{"text_format":"1","workbook":"xlsx","n_sheets":4,"sheets":["PJ-JV","System","JV Format","Translation"],"not_rendered":{"charts":0,"images":0,"macros":1,"external_links":0,"defined_names":21,"comments":1,"pivot_tables":0},"unopened":[],"bounds":{"document_bytes":16777216,"sheet_cells":100000,"rows_first":2000,"rows_last":500,"rows_between":2000,"halvings":0,"cell_chars":16384,"cell_head_chars":4096},"cells_cut":0,"cells_raw":0,"read":"whole","date_system":"1900"}

{"sheet":"PJ-JV","index":0,"n_rows":113,"n_cols":25,"rows_kept":113,"cut":false,"hidden":false,"merged":[[7,0,7,2],[8,0,8,2],[5,3,5,4],[6,3,6,5],[3,0,3,2],[4,0,4,2],[5,0,5,2],[6,0,6,2],[7,3,7,6]]}
[null,null,null,null,null,null,null,null,{"$f":"IF(JV_SELECTED_LANGUAGE=\"EN\",Translation!A35,Translation!B35)","v":"Sélectionner la langue --­>"},"EN"]
[]
[{"$f":"IF(JV_SELECTED_LANGUAGE=\"EN\",Translation!A36,Translation!B36)","v":"* Indicates mandatory fields"}]
[{"$f":"IF(JV_SELECTED_LANGUAGE=\"EN\",Translation!A2,Translation!B2)","v":"Document Date *"},null,null,null,null,null,null,null,{"$f":"IF(JV_SELECTED_LANGUAGE=\"EN\",Translation!A8,Translation!B8)","v":"Currency (3 Char)"},"CAD"]
[{"$f":"IF(JV_SELECTED_LANGUAGE=\"EN\",Translation!A3,Translation!B3)","v":"Posting Date"},null,null,{"$f":"NOW()","v":"2020-12-11T10:32:17.170"},null,null,null,null,{"$f":"IF(JV_SELECTED_LANGUAGE=\"EN\",Translation!A9,Translation!B9)","v":"Fiscal Period (2 Char)"},"Current"]
[{"$f":"IF(JV_SELECTED_LANGUAGE=\"EN\",Translation!A4,Translation!B4)","v":"Header Reference (16 Char) *"}]
[{"$f":"IF(JV_SELECTED_LANGUAGE=\"EN\",Translation!A5,Translation!B5)","v":"Header Text (25 Char)"}]
[{"$f":"IF(JV_SELECTED_LANGUAGE=\"EN\",Translation!A6,Translation!B6)","v":"Document Type *"}]
[{"$f":"IF(JV_SELECTED_LANGUAGE=\"EN\",Translation!A7,Translation!B7)","v":"Company Code *"},null,null,null,null,null,null,null,null,{"$f":"IF(JV_SELECTED_LANGUAGE=\"EN\",Translation!A11,Translation!B11)","v":"Warnings :"}]
[null,null,null,null,null,null,null,null,{"$f":"ABS(SUM(D14:D113))<0.001","v":true},{"$f":"IF(I10,\"\",IF(JV_SELECTED_LANGUAGE=\"EN\",Translation!A12,Translation!B12))","v":""}]
[{"$f":"IF(JV_SELECTED_LANGUAGE=\"EN\",Translation!A10,Translation!B10)","v":"Trading Partner (3 Char)"},null,null,null,null,null,null,null,{"$f":"AND(SUM(V14:Y113)=0,NOT(D4=\"\"),NOT(D6=\"\"),NOT(JV_DOCUMENT_TYPE=\"\"),NOT(D9=\"\"))","v":false},{"$f":"IF(I11,\"\",IF(JV_SELECTED_LANGUAGE=\"EN\",Translation!A13,Translation!B13))","v":"Missing mandatory fields"}]
[]
[{"$f":"IF(JV_SELECTED_LANGUAGE=\"EN\",Translation!A14,Translation!B14)","v":"Company Code"},{"$f":"IF(JV_SELECTED_LANGUAGE=\"EN\",Translation!A15,Translation!B15)","v":"Line \nItem # "},{"$f":"IF(JV_SELECTED_LANGUAGE=\"EN\",Translation!A16,Translation!B16)","v":"G/L Account\n(6 Char) *"},{"$f":"IF(JV_SELECTED_LANGUAGE=\"EN\",Translation!A17,Translation!B17)","v":"Amount\n(15 Char) *\nDebit (+)\nCredit (-)"},{"$f":"IF(JV_SELECTED_LANGUAGE=\"EN\",Translation!A18,Translation!B18)","v":"Cost Centre \n(6 Char) *"},{"$f":"IF(JV_SELECTED_LANGUAGE=\"EN\",Translation!A19,Translation!B19)","v":"Fund\n(4 Char) *"},{"$f":"IF(JV_SELECTED_LANGUAGE=\"EN\",Translation!A20,Translation!B20)","v":"Functional Area \n(9 Char) *"},{"$f":"IF(JV_SELECTED_LANGUAGE=\"EN\",Translation!A21,Translation!B21)","v":"Internal Order \n(5 or 6 Char)"},{"$f":"IF(JV_SELECTED_LANGUAGE=\"EN\",Translation!A22,Translation!B22)","v":"Work Breakdown Structure (24 Char)"},{"$f":"IF(JV_SELECTED_LANGUAGE=\"EN\",Translation!A23,Translation!B23)","v":"Assignment \n(18 Char)"},{"$f":"IF(JV_SELECTED_LANGUAGE=\"EN\",Translation!A24,Translation!B24)","v":"Line Item Text\nFor salary use, please indicate the salary period.\n(50 Char)"},{"$f":"IF(JV_SELECTED_LANGUAGE=\"EN\",Translation!A25,Translation!B25)","v":"PRI \n(8 Char)"},{"$f":"IF(JV_SELECTED_LANGUAGE=\"EN\",Translation!A26,Translation!B26)","v":"Earmarked Fund #\n(10 Char)"},{"$f":"IF(JV_SELECTED_LANGUAGE=\"EN\",Translation!A27,Translation!B27)","v":"Earmarked Fund Line #\n(3 Char)"},{"$f":"IF(JV_SELECTED_LANGUAGE=\"EN\",Translation!A28,Translation!B28)","v":"Fund Centre \n(6 Char)"},{"$f":"IF(JV_SELECTED_LANGUAGE=\"EN\",Translation!A29,Translation!B29)","v":"Client Department Office\n(4 Char)"},{"$f":"IF(JV_SELECTED_LANGUAGE=\"EN\",Translation!A30,Translation!B30)","v":"Network \n(5 Char)"},{"$f":"IF(JV_SELECTED_LANGUAGE=\"EN\",Translation!A31,Translation!B31)","v":"Network Activity \n(4 Char)"},{"$f":"IF(JV_SELECTED_LANGUAGE=\"EN\",Translation!A32,Translation!B32)","v":"User Text1\n(12 Char)"},{"$f":"IF(JV_SELECTED_LANGUAGE=\"EN\",Translation!A33,Translation!B33)","v":"User Text2 \n(12 Char)"},{"$f":"IF(JV_SELECTED_LANGUAGE=\"EN\",Translation!A34,Translation!B34)","v":"User Text3 \n(20 Char)"}]
[null,"001",null,null,null,null,null,null,null,null,null,null,null,null,null,null,null,null,null,null,null,{"$f":"IF(OR(D14<0,D14>0),IF(OR(C14=\"\",E14=\"\",F14=\"\",G14=\"\"),1,0),0)","v":0},{"$f":"IF(AND(M14<>\"\",N14=\"\"),1,0)","v":0},{"$f":"IF(AND(C14<>\"\",L14=\"\",IF(ISERROR(VLOOKUP(C14,SalaryGLRequiredPRI,1,FALSE)),0,1)=1),1,0)","v":0},{"$f":"IF(AND(C14<>\"\",K14=\"\",IF(ISERROR(VLOOKUP(C14,SalaryGLRequiredPRI,1,FALSE)),0,1)=1),1,0)","v":0}]
[null,"002",null,null,null,null,null,null,null,null,null,null,null,null,null,null,null,null,null,null,null,0,{"$f":"IF(AND(M15<>\"\",N15=\"\"),1,0)","v":0},0,0]
[null,"003",null,null,null,null,null,null,null,null,null,null,null,null,null,null,null,null,null,null,null,0,0,0,0]
[null,"004",null,null,null,null,null,null,null,null,null,null,null,null,null,null,null,null,null,null,null,0,0,0,0]
[null,"005",null,null,null,null,null,null,null,null,null,null,null,null,null,null,null,null,null,null,null,0,0,0,0]
[null,"006",null,null,null,null,null,null,null,null,null,null,null,null,null,null,null,null,null,null,null,0,0,0,0]
[null,"007",null,null,null,null,null,null,null,null,null,null,null,null,null,null,null,null,null,null,null,0,0,0,0]
[null,"008",null,null,null,null,null,null,null,null,null,null,null,null,null,null,null,null,null,null,null,0,0,0,0]
[null,"009",null,null,null,null,null,null,null,null,null,null,null,null,null,null,null,null,null,null,null,0,0,0,0]
[null,"010",null,null,null,null,null,null,null,null,null,null,null,null,null,null,null,null,null,null,null,0,0,0,0]
[null,"011",null,null,null,null,null,null,null,null,null,null,null,null,null,null,null,null,null,null,null,0,0,0,0]
[null,"012",null,null,null,null,null,null,null,null,null,null,null,null,null,null,null,null,null,null,null,0,0,0,0]
[null,"013",null,null,null,null,null,null,null,null,null,null,null,null,null,null,null,null,null,null,null,0,0,0,0]
[null,"014",null,null,null,null,null,null,null,null,null,null,null,null,null,null,null,null,null,null,null,0,0,0,0]
[null,"015",null,null,null,null,null,null,null,null,null,null,null,null,null,null,null,null,null,null,null,0,0,0,0]
[null,"016",null,null,null,null,null,null,null,null,null,null,null,null,null,null,null,null,null,null,null,0,0,0,0]
[null,"017",null,null,null,null,null,null,null,null,null,null,null,null,null,null,null,null,null,null,null,0,0,0,0]
[null,"018",null,null,null,null,null,null,null,null,null,null,null,null,null,null,null,null,null,null,null,0,0,0,0]
[null,"019",null,null,null,null,null,null,null,null,null,null,null,null,null,null,null,null,null,null,null,0,0,0,0]
[null,"020",null,null,null,null,null,null,null,null,null,null,null,null,null,null,null,null,null,null,null,0,0,0,0]
[null,"021",null,null,null,null,null,null,null,null,null,null,null,null,null,null,null,null,null,null,null,0,0,0,0]
[null,"022",null,null,null,null,null,null,null,null,null,null,null,null,null,null,null,null,null,null,null,0,0,0,0]
[null,"023",null,null,null,null,null,null,null,null,null,null,null,null,null,null,null,null,null,null,null,0,0,0,0]
[null,"024",null,null,null,null,null,null,null,null,null,null,null,null,null,null,null,null,null,null,null,0,0,0,0]
[null,"025",null,null,null,null,null,null,null,null,null,null,null,null,null,null,null,null,null,null,null,0,0,0,0]
[null,"026",null,null,null,null,null,null,null,null,null,null,null,null,null,null,null,null,null,null,null,0,0,0,0]
[null,"027",null,null,null,null,null,null,null,null,null,null,null,null,null,null,null,null,null,null,null,0,0,0,0]
[null,"028",null,null,null,null,null,null,null,null,null,null,null,null,null,null,null,null,null,null,null,0,0,0,0]
[null,"029",null,null,null,null,null,null,null,null,null,null,null,null,null,null,null,null,null,null,null,0,0,0,0]
[null,"030",null,null,null,null,null,null,null,null,null,null,null,null,null,null,null,null,null,null,null,0,0,0,0]
[null,"031",null,null,null,null,null,null,null,null,null,null,null,null,null,null,null,null,null,null,null,0,0,0,0]
[null,"032",null,null,null,null,null,null,null,null,null,null,null,null,null,null,null,null,null,null,null,0,0,0,0]
[null,"033",null,null,null,null,null,null,null,null,null,null,null,null,null,null,null,null,null,null,null,0,0,{"$f":"IF(AND(C46<>\"\",L46=\"\",IF(ISERROR(VLOOKUP(C46,SalaryGLRequiredPRI,1,FALSE)),0,1)=1),1,0)","v":0},{"$f":"IF(AND(C46<>\"\",K46=\"\",IF(ISERROR(VLOOKUP(C46,SalaryGLRequiredPRI,1,FALSE)),0,1)=1),1,0)","v":0}]
[null,"034",null,null,null,null,null,null,null,null,null,null,null,null,null,null,null,null,null,null,null,0,0,0,0]
[null,"035",null,null,null,null,null,null,null,null,null,null,null,null,null,null,null,null,null,null,null,0,0,0,0]
[null,"036",null,null,null,null,null,null,null,null,null,null,null,null,null,null,null,null,null,null,null,0,0,0,0]
[null,"037",null,null,null,null,null,null,null,null,null,null,null,null,null,null,null,null,null,null,null,0,0,0,0]
[null,"038",null,null,null,null,null,null,null,null,null,null,null,null,null,null,null,null,null,null,null,0,0,0,0]
[null,"039",null,null,null,null,null,null,null,null,null,null,null,null,null,null,null,null,null,null,null,0,0,0,0]
[null,"040",null,null,null,null,null,null,null,null,null,null,null,null,null,null,null,null,null,null,null,0,0,0,0]
[null,"041",null,null,null,null,null,null,null,null,null,null,null,null,null,null,null,null,null,null,null,0,0,0,0]
[null,"042",null,null,null,null,null,null,null,null,null,null,null,null,null,null,null,null,null,null,null,0,0,0,0]
[null,"043",null,null,null,null,null,null,null,null,null,null,null,null,null,null,null,null,null,null,null,0,0,0,0]
[null,"044",null,null,null,null,null,null,null,null,null,null,null,null,null,null,null,null,null,null,null,0,0,0,0]
[null,"045",null,null,null,null,null,null,null,null,null,null,null,null,null,null,null,null,null,null,null,0,0,0,0]
[null,"046",null,null,null,null,null,null,null,null,null,null,null,null,null,null,null,null,null,null,null,0,0,0,0]
[null,"047",null,null,null,null,null,null,null,null,null,null,null,null,null,null,null,null,null,null,null,0,0,0,0]
[null,"048",null,null,null,null,null,null,null,null,null,null,null,null,null,null,null,null,null,null,null,0,0,0,0]
[null,"049",null,null,null,null,null,null,null,null,null,null,null,null,null,null,null,null,null,null,null,0,0,0,0]
[null,"050",null,null,null,null,null,null,null,null,null,null,null,null,null,null,null,null,null,null,null,0,0,0,0]
[null,"051",null,null,null,null,null,null,null,null,null,null,null,null,null,null,null,null,null,null,null,0,0,0,0]
[null,"052",null,null,null,null,null,null,null,null,null,null,null,null,null,null,null,null,null,null,null,0,0,0,0]
[null,"053",null,null,null,null,null,null,null,null,null,null,null,null,null,null,null,null,null,null,null,0,0,0,0]
[null,"054",null,null,null,null,null,null,null,null,null,null,null,null,null,null,null,null,null,null,null,0,0,0,0]
[null,"055",null,null,null,null,null,null,null,null,null,null,null,null,null,null,null,null,null,null,null,0,0,0,0]
[null,"056",null,null,null,null,null,null,null,null,null,null,null,null,null,null,null,null,null,null,null,0,0,0,0]
[null,"057",null,null,null,null,null,null,null,null,null,null,null,null,null,null,null,null,null,null,null,0,0,0,0]
[null,"058",null,null,null,null,null,null,null,null,null,null,null,null,null,null,null,null,null,null,null,0,0,0,0]
[null,"059",null,null,null,null,null,null,null,null,null,null,null,null,null,null,null,null,null,null,null,0,0,0,0]
[null,"060",null,null,null,null,null,null,null,null,null,null,null,null,null,null,null,null,null,null,null,0,0,0,0]
[null,"061",null,null,null,null,null,null,null,null,null,null,null,null,null,null,null,null,null,null,null,0,0,0,0]
[null,"062",null,null,null,null,null,null,null,null,null,null,null,null,null,null,null,null,null,null,null,0,0,0,0]
[null,"063",null,null,null,null,null,null,null,null,null,null,null,null,null,null,null,null,null,null,null,0,0,0,0]
[null,"064",null,null,null,null,null,null,null,null,null,null,null,null,null,null,null,null,null,null,null,0,0,0,0]
[null,"065",null,null,null,null,null,null,null,null,null,null,null,null,null,null,null,null,null,null,null,0,0,{"$f":"IF(AND(C78<>\"\",L78=\"\",IF(ISERROR(VLOOKUP(C78,SalaryGLRequiredPRI,1,FALSE)),0,1)=1),1,0)","v":0},{"$f":"IF(AND(C78<>\"\",K78=\"\",IF(ISERROR(VLOOKUP(C78,SalaryGLRequiredPRI,1,FALSE)),0,1)=1),1,0)","v":0}]
[null,"066",null,null,null,null,null,null,null,null,null,null,null,null,null,null,null,null,null,null,null,{"$f":"IF(OR(D79<0,D79>0),IF(OR(C79=\"\",E79=\"\",F79=\"\",G79=\"\"),1,0),0)","v":0},{"$f":"IF(AND(M79<>\"\",N79=\"\"),1,0)","v":0},0,0]
[null,"067",null,null,null,null,null,null,null,null,null,null,null,null,null,null,null,null,null,null,null,0,0,0,0]
[null,"068",null,null,null,null,null,null,null,null,null,null,null,null,null,null,null,null,null,null,null,0,0,0,0]
[null,"069",null,null,null,null,null,null,null,null,null,null,null,null,null,null,null,null,null,null,null,0,0,0,0]
[null,"070",null,null,null,null,null,null,null,null,null,null,null,null,null,null,null,null,null,null,null,0,0,0,0]
[null,"071",null,null,null,null,null,null,null,null,null,null,null,null,null,null,null,null,null,null,null,0,0,0,0]
[null,"072",null,null,null,null,null,null,null,null,null,null,null,null,null,null,null,null,null,null,null,0,0,0,0]
[null,"073",null,null,null,null,null,null,null,null,null,null,null,null,null,null,null,null,null,null,null,0,0,0,0]
[null,"074",null,null,null,null,null,null,null,null,null,null,null,null,null,null,null,null,null,null,null,0,0,0,0]
[null,"075",null,null,null,null,null,null,null,null,null,null,null,null,null,null,null,null,null,null,null,0,0,0,0]
[null,"076",null,null,null,null,null,null,null,null,null,null,null,null,null,null,null,null,null,null,null,0,0,0,0]
[null,"077",null,null,null,null,null,null,null,null,null,null,null,null,null,null,null,null,null,null,null,0,0,0,0]
[null,"078",null,null,null,null,null,null,null,null,null,null,null,null,null,null,null,null,null,null,null,0,0,0,0]
[null,"079",null,null,null,null,null,null,null,null,null,null,null,null,null,null,null,null,null,null,null,0,0,0,0]
[null,"080",null,null,null,null,null,null,null,null,null,null,null,null,null,null,null,null,null,null,null,0,0,0,0]
[null,"081",null,null,null,null,null,null,null,null,null,null,null,null,null,null,null,null,null,null,null,0,0,0,0]
[null,"082",null,null,null,null,null,null,null,null,null,null,null,null,null,null,null,null,null,null,null,0,0,0,0]
[null,"083",null,null,null,null,null,null,null,null,null,null,null,null,null,null,null,null,null,null,null,0,0,0,0]
[null,"084",null,null,null,null,null,null,null,null,null,null,null,null,null,null,null,null,null,null,null,0,0,0,0]
[null,"085",null,null,null,null,null,null,null,null,null,null,null,null,null,null,null,null,null,null,null,0,0,0,0]
[null,"086",null,null,null,null,null,null,null,null,null,null,null,null,null,null,null,null,null,null,null,0,0,0,0]
[null,"087",null,null,null,null,null,null,null,null,null,null,null,null,null,null,null,null,null,null,null,0,0,0,0]
[null,"088",null,null,null,null,null,null,null,null,null,null,null,null,null,null,null,null,null,null,null,0,0,0,0]
[null,"089",null,null,null,null,null,null,null,null,null,null,null,null,null,null,null,null,null,null,null,0,0,0,0]
[null,"090",null,null,null,null,null,null,null,null,null,null,null,null,null,null,null,null,null,null,null,0,0,0,0]
[null,"091",null,null,null,null,null,null,null,null,null,null,null,null,null,null,null,null,null,null,null,0,0,0,0]
[null,"092",null,null,null,null,null,null,null,null,null,null,null,null,null,null,null,null,null,null,null,0,0,0,0]
[null,"093",null,null,null,null,null,null,null,null,null,null,null,null,null,null,null,null,null,null,null,0,0,0,0]
[null,"094",null,null,null,null,null,null,null,null,null,null,null,null,null,null,null,null,null,null,null,0,0,0,0]
[null,"095",null,null,null,null,null,null,null,null,null,null,null,null,null,null,null,null,null,null,null,0,0,0,0]
[null,"096",null,null,null,null,null,null,null,null,null,null,null,null,null,null,null,null,null,null,null,0,0,0,0]
[null,"097",null,null,null,null,null,null,null,null,null,null,null,null,null,null,null,null,null,null,null,0,0,0,0]
[null,"098",null,null,null,null,null,null,null,null,null,null,null,null,null,null,null,null,null,null,null,0,0,0,0]
[null,"099",null,null,null,null,null,null,null,null,null,null,null,null,null,null,null,null,null,null,null,0,0,0,0]
[null,"100",null,null,null,null,null,null,null,null,null,null,null,null,null,null,null,null,null,null,null,0,0,0,0]

{"sheet":"System","index":1,"n_rows":52,"n_cols":20,"rows_kept":52,"cut":false,"hidden":true,"merged":[[0,0,0,1],[0,3,0,7],[0,9,0,12]]}
["Constant",null,null,"Mandatory Fields",null,null,null,null,null,"Drop downs",null,null,null,null,"Salary GL",null,"Tool","CurrentVersion","Title","Publishing Date"]
["Posting Folder","https://dialogue/grp/CR-AR/NAOPTypeP16JVExcelGate/",null,"Mandatory Fields name","Mandatory Field column","Mandatory Field Row","Error Message EN","Error Message FR",null,"Company Codes EN","Company Codes FR","Document Type EN","Document Type FR",null,"PRI Required",null,"Journal Voucher","4","Excel Template",43307]
["Company Code list",{"$f":"IF(JV_SELECTED_LANGUAGE=\"EN\",\"System!J3:J\"&2+COUNTA(J3:J40),\"System!K3:K\"&2+COUNTA(K3:K40))","v":"System!J3:J5"},null,"Company Code Header",4,9,null,null,null,"0140 ESDC","0140 EDSC","SA Internal Corrections","SA Corrections internes",null,521101,null,"THCEE","V 8-44","Excel Template",43922]
["Document Type list",{"$f":"IF(JV_SELECTED_LANGUAGE=\"EN\",\"System!L3:L\"&2+COUNTA(L3:L40),\"System!M3:M\"&2+COUNTA(M3:M40))","v":"System!L3:L6"},null,"Document Date",4,4,null,null,null,"0141 CPP","0141 RPC","SB Cross Branch","SB inter DG",null,521102]
["Error msg not in balance EN","The total of the journal voucher must equal 0$.",null,"Document Type",4,8,null,null,null,"0142 EI","0142 AE","SI Internal I/E Corrections","SI Corrections Interne I/E",null,521103]
["Error msg not in balance FR","La somme de la pièce de journal doit être égale à $0.",null,"Header Reference",4,6,null,null,null,null,null,"SZ Corporate Adjustments","SZ Ajustements corporatifs",null,521201]
["Error msg mandatory fields missing EN","All mandatory fields must be completed.",null,"G/L Accounts",3,"Items",null,null,null,null,null,null,null,null,521202]
["Error msg mandatory fields missing FR","Tous les champs obligatoires doivent être complétés.",null,"Cost centre",5,"Items",null,null,null,null,null,null,null,null,521203]
["Parameter1 Name","DocRoute",null,"Fund",6,"Items",null,null,null,null,null,null,null,null,521204]
["Parameter2 Name","JVPJID",null,"Functional Area",7,"Items",null,null,null,null,null,null,null,null,521301]
["Submission Form URL","https://dialogue/grp/CR-AR/Lists/NAOPRequestsGateTypeP16/NewForm.aspx",null,null,null,null,null,null,null,null,null,null,null,null,521401]
["Redirect Page","https%3A%2F%2Fdialogue%2Fgrp%2FCR-AR%2FSitePages%2FMerci-ThankYou.aspx",null,null,null,null,null,null,null,null,null,null,null,null,521402]
["Complete Submission Form Path",{"$f":"CONCATENATE(B11,\"?\",B9,\"=\",JV_DOC_LIBRARY_ADDRESS,B14,\".xlsm\",\"&\",B10,\"=\",JV_JV_ID,\"&Source=https%3A%2F%2Fdialogue%2Fgrp%2FCR-AR%2FSitePages%2FMerci-ThankYou.aspx\")","v":"https://dialogue/grp/CR-AR/Lists/NAOPRequestsGateTypeP16/NewForm.aspx?DocRoute=https://dialogue/grp/CR-AR/NAOPTypeP16JVExcelGate/.xlsm&JVPJID=&Source=https%3A%2F%2Fdialogue%2Fgrp%2FCR-AR%2FSitePages%2FMerci-ThankYou.aspx"},null,null,null,null,null,null,null,null,null,null,null,null,521403]
["JVID",null,null,null,null,null,null,null,null,null,null,null,null,null,521501]
["JV Save Status",null,null,null,null,null,null,null,null,null,null,null,null,null,521601]
["JV Template Version","4.1",null,null,null,null,null,null,null,null,null,null,null,null,521701]
["Current Version",{"$f":"B16=VLOOKUP(\"Journal Voucher\",Table_owssvr[],2,FALSE)","v":false},null,null,null,null,null,null,null,null,null,null,null,null,521702]
[null,null,null,null,null,null,null,null,null,null,null,null,null,null,521703]
[null,null,null,null,null,null,null,null,null,null,null,null,null,null,521710]
[null,null,null,null,null,null,null,null,null,null,null,null,null,null,521801]
["Submitted on 2015-16 & approved excel templates","http://dialogue/grp/CR-AR/NAOPTypeP16JV/",null,null,null,null,null,null,null,null,null,null,null,null,521802]
["New Excel Gate for 2016-17 and after","https://dialogue/grp/CR-AR/NAOPTypeP16JVExcelGate/",null,null,null,null,null,null,null,null,null,null,null,null,521901]
[null,null,null,null,null,null,null,null,null,null,null,null,null,null,521911]
[null,null,null,null,null,null,null,null,null,null,null,null,null,null,521912]
[null,null,null,null,null,null,null,null,null,null,null,null,null,null,521921]
[null,null,null,null,null,null,null,null,null,null,null,null,null,null,523101]
[null,null,null,null,null,null,null,null,null,null,null,null,null,null,523102]
[null,null,null,null,null,null,null,null,null,null,null,null,null,null,523201]
[null,null,null,null,null,null,null,null,null,null,null,null,null,null,523301]
[null,null,null,null,null,null,null,null,null,null,null,null,null,null,523311]
[null,null,null,null,null,null,null,null,null,null,null,null,null,null,523401]
[null,null,null,null,null,null,null,null,null,null,null,null,null,null,523411]
[null,null,null,null,null,null,null,null,null,null,null,null,null,null,523412]
[null,null,null,null,null,null,null,null,null,null,null,null,null,null,523413]
[null,null,null,null,null,null,null,null,null,null,null,null,null,null,523414]
[null,null,null,null,null,null,null,null,null,null,null,null,null,null,523415]
[null,null,null,null,null,null,null,null,null,null,null,null,null,null,523416]
[null,null,null,null,null,null,null,null,null,null,null,null,null,null,523501]
[null,null,null,null,null,null,null,null,null,null,null,null,null,null,523511]
[null,null,null,null,null,null,null,null,null,null,null,null,null,null,523521]
[null,null,null,null,null,null,null,null,null,null,null,null,null,null,523531]
[null,null,null,null,null,null,null,null,null,null,null,null,null,null,523561]
[null,null,null,null,null,null,null,null,null,null,null,null,null,null,524201]
[null,null,null,null,null,null,null,null,null,null,null,null,null,null,524301]
[null,null,null,null,null,null,null,null,null,null,null,null,null,null,524302]
[null,null,null,null,null,null,null,null,null,null,null,null,null,null,524303]
[null,null,null,null,null,null,null,null,null,null,null,null,null,null,524401]
[null,null,null,null,null,null,null,null,null,null,null,null,null,null,525101]
[null,null,null,null,null,null,null,null,null,null,null,null,null,null,525102]
[null,null,null,null,null,null,null,null,null,null,null,null,null,null,525202]
[null,null,null,null,null,null,null,null,null,null,null,null,null,null,533402]
[null,null,null,null,null,null,null,null,null,null,null,null,null,null,538101]

{"sheet":"JV Format","index":2,"n_rows":102,"n_cols":30,"rows_kept":102,"cut":false,"hidden":true,"merged":[]}
["Record Type \n(2 char)","Company Code\n(4 Char)","Line \nItem # \n(3 Char)","Posting Date \n(8 Char)","Document Date\n(8 Char)","Currency \n(3 Char)","Document Type \n(2 Char)","Fiscal \nPeriod\n(2 Char)","Header Reference \n(16 Char)","Header Text \n(25 Char)","Trading Partner\n(3 Char)","G/L Account\n(6 Char)","Amount\n(15 Char)","Cost Centre \n(6 Char)","Fund\n(4 Char)","Functional Area \n(9 Char)","Order \n(5-6 Char)","Work Breakdown Structure (24 Char)","Assignment Text \n(18 Char)","Line Item Text (50 Char)","PRI \n(8 Char)","Earmarked Fund #\n(10 Char)","Earmarked Fund Line #\n(3 Char)","Fund Centre \n(6 Char)","Client Department Office\n(4 Char)","Network \n(5 Char)","Network Activity \n(4 Char)","User Text1\n(12 Char)","User Text2 \n(12 Char)","User Text3 \n(20 Char)"]
["HD",{"$f":"LEFT('PJ-JV'!D9,4)","v":""},null,{"$f":"TEXT('PJ-JV'!D5,\"YYYYMMDD\")","v":"20201211"},{"$f":"TEXT('PJ-JV'!D4,\"YYYYMMDD\")","v":"19000100"},{"$f":"'PJ-JV'!J4","v":"CAD"},{"$f":"LEFT('PJ-JV'!D8,2)","v":""},null,{"$f":"LEFT('PJ-JV'!D6,16)","v":""},{"$f":"LEFT('PJ-JV'!D7,25)","v":""},{"$f":"LEFT('PJ-JV'!D11,3)","v":""}]
[{"$f":"IF('PJ-JV'!D14=0,\"\",\"IT\")","v":""},null,{"$f":"IF('PJ-JV'!D14=0,\"\",'PJ-JV'!B14)","v":""},null,null,null,null,null,null,null,null,{"$f":"IF('PJ-JV'!D14=0,\"\",LEFT('PJ-JV'!C14,6))","v":""},{"$f":"IF('PJ-JV'!D14=0,\"\",ROUND('PJ-JV'!D14,2))","v":""},{"$f":"IF('PJ-JV'!D14=0,\"\",LEFT('PJ-JV'!E14,6))","v":""},{"$f":"IF('PJ-JV'!D14=0,\"\",PROPER(LEFT('PJ-JV'!F14,4)))","v":""},{"$f":"IF('PJ-JV'!D14=0,\"\",LEFT('PJ-JV'!G14,9))","v":""},{"$f":"IF('PJ-JV'!D14=0,\"\",LEFT('PJ-JV'!H14,6))","v":""},{"$f":"IF('PJ-JV'!D14=0,\"\",LEFT('PJ-JV'!I14,24))","v":""},{"$f":"IF('PJ-JV'!D14=0,\"\",LEFT('PJ-JV'!J14,18))","v":""},{"$f":"IF('PJ-JV'!D14=0,\"\",LEFT('PJ-JV'!K14,50))","v":""},{"$f":"IF('PJ-JV'!D14=0,\"\",LEFT('PJ-JV'!L14,8))","v":""},{"$f":"IF('PJ-JV'!D14=0,\"\",LEFT('PJ-JV'!M14,10))","v":""},{"$f":"IF('PJ-JV'!D14=0,\"\",LEFT('PJ-JV'!N14,3))","v":""},{"$f":"IF('PJ-JV'!D14=0,\"\",LEFT('PJ-JV'!O14,6))","v":""},{"$f":"IF('PJ-JV'!D14=0,\"\",LEFT('PJ-JV'!P14,4))","v":""},{"$f":"IF('PJ-JV'!D14=0,\"\",LEFT('PJ-JV'!Q14,5))","v":""},{"$f":"IF('PJ-JV'!D14=0,\"\",LEFT('PJ-JV'!R14,4))","v":""},{"$f":"IF('PJ-JV'!D14=0,\"\",LEFT('PJ-JV'!S14,12))","v":""},{"$f":"IF('PJ-JV'!D14=0,\"\",LEFT('PJ-JV'!T14,12))","v":""},{"$f":"IF('PJ-JV'!D14=0,\"\",LEFT('PJ-JV'!U14,20))","v":""}]
[{"$f":"IF('PJ-JV'!D15=0,\"\",\"IT\")","v":""},null,{"$f":"IF('PJ-JV'!D15=0,\"\",'PJ-JV'!B15)","v":""},null,null,null,null,null,null,null,null,{"$f":"IF('PJ-JV'!D15=0,\"\",LEFT('PJ-JV'!C15,6))","v":""},{"$f":"IF('PJ-JV'!D15=0,\"\",ROUND('PJ-JV'!D15,2))","v":""},{"$f":"IF('PJ-JV'!D15=0,\"\",LEFT('PJ-JV'!E15,6))","v":""},{"$f":"IF('PJ-JV'!D15=0,\"\",PROPER(LEFT('PJ-JV'!F15,4)))","v":""},{"$f":"IF('PJ-JV'!D15=0,\"\",LEFT('PJ-JV'!G15,9))","v":""},{"$f":"IF('PJ-JV'!D15=0,\"\",LEFT('PJ-JV'!H15,6))","v":""},{"$f":"IF('PJ-JV'!D15=0,\"\",LEFT('PJ-JV'!I15,24))","v":""},{"$f":"IF('PJ-JV'!D15=0,\"\",LEFT('PJ-JV'!J15,18))","v":""},{"$f":"IF('PJ-JV'!D15=0,\"\",LEFT('PJ-JV'!K15,50))","v":""},{"$f":"IF('PJ-JV'!D15=0,\"\",LEFT('PJ-JV'!L15,8))","v":""},{"$f":"IF('PJ-JV'!D15=0,\"\",LEFT('PJ-JV'!M15,10))","v":""},{"$f":"IF('PJ-JV'!D15=0,\"\",LEFT('PJ-JV'!N15,3))","v":""},{"$f":"IF('PJ-JV'!D15=0,\"\",LEFT('PJ-JV'!O15,6))","v":""},{"$f":"IF('PJ-JV'!D15=0,\"\",LEFT('PJ-JV'!P15,4))","v":""},{"$f":"IF('PJ-JV'!D15=0,\"\",LEFT('PJ-JV'!Q15,5))","v":""},{"$f":"IF('PJ-JV'!D15=0,\"\",LEFT('PJ-JV'!R15,4))","v":""},{"$f":"IF('PJ-JV'!D15=0,\"\",LEFT('PJ-JV'!S15,12))","v":""},{"$f":"IF('PJ-JV'!D15=0,\"\",LEFT('PJ-JV'!T15,12))","v":""},{"$f":"IF('PJ-JV'!D15=0,\"\",LEFT('PJ-JV'!U15,20))","v":""}]
[{"$f":"IF('PJ-JV'!D16=0,\"\",\"IT\")","v":""},null,{"$f":"IF('PJ-JV'!D16=0,\"\",'PJ-JV'!B16)","v":""},null,null,null,null,null,null,null,null,{"$f":"IF('PJ-JV'!D16=0,\"\",LEFT('PJ-JV'!C16,6))","v":""},{"$f":"IF('PJ-JV'!D16=0,\"\",ROUND('PJ-JV'!D16,2))","v":""},{"$f":"IF('PJ-JV'!D16=0,\"\",LEFT('PJ-JV'!E16,6))","v":""},{"$f":"IF('PJ-JV'!D16=0,\"\",PROPER(LEFT('PJ-JV'!F16,4)))","v":""},{"$f":"IF('PJ-JV'!D16=0,\"\",LEFT('PJ-JV'!G16,9))","v":""},{"$f":"IF('PJ-JV'!D16=0,\"\",LEFT('PJ-JV'!H16,6))","v":""},{"$f":"IF('PJ-JV'!D16=0,\"\",LEFT('PJ-JV'!I16,24))","v":""},{"$f":"IF('PJ-JV'!D16=0,\"\",LEFT('PJ-JV'!J16,18))","v":""},{"$f":"IF('PJ-JV'!D16=0,\"\",LEFT('PJ-JV'!K16,50))","v":""},{"$f":"IF('PJ-JV'!D16=0,\"\",LEFT('PJ-JV'!L16,8))","v":""},{"$f":"IF('PJ-JV'!D16=0,\"\",LEFT('PJ-JV'!M16,10))","v":""},{"$f":"IF('PJ-JV'!D16=0,\"\",LEFT('PJ-JV'!N16,3))","v":""},{"$f":"IF('PJ-JV'!D16=0,\"\",LEFT('PJ-JV'!O16,6))","v":""},{"$f":"IF('PJ-JV'!D16=0,\"\",LEFT('PJ-JV'!P16,4))","v":""},{"$f":"IF('PJ-JV'!D16=0,\"\",LEFT('PJ-JV'!Q16,5))","v":""},{"$f":"IF('PJ-JV'!D16=0,\"\",LEFT('PJ-JV'!R16,4))","v":""},{"$f":"IF('PJ-JV'!D16=0,\"\",LEFT('PJ-JV'!S16,12))","v":""},{"$f":"IF('PJ-JV'!D16=0,\"\",LEFT('PJ-JV'!T16,12))","v":""},{"$f":"IF('PJ-JV'!D16=0,\"\",LEFT('PJ-JV'!U16,20))","v":""}]
[{"$f":"IF('PJ-JV'!D17=0,\"\",\"IT\")","v":""},null,{"$f":"IF('PJ-JV'!D17=0,\"\",'PJ-JV'!B17)","v":""},null,null,null,null,null,null,null,null,{"$f":"IF('PJ-JV'!D17=0,\"\",LEFT('PJ-JV'!C17,6))","v":""},{"$f":"IF('PJ-JV'!D17=0,\"\",ROUND('PJ-JV'!D17,2))","v":""},{"$f":"IF('PJ-JV'!D17=0,\"\",LEFT('PJ-JV'!E17,6))","v":""},{"$f":"IF('PJ-JV'!D17=0,\"\",PROPER(LEFT('PJ-JV'!F17,4)))","v":""},{"$f":"IF('PJ-JV'!D17=0,\"\",LEFT('PJ-JV'!G17,9))","v":""},{"$f":"IF('PJ-JV'!D17=0,\"\",LEFT('PJ-JV'!H17,6))","v":""},{"$f":"IF('PJ-JV'!D17=0,\"\",LEFT('PJ-JV'!I17,24))","v":""},{"$f":"IF('PJ-JV'!D17=0,\"\",LEFT('PJ-JV'!J17,18))","v":""},{"$f":"IF('PJ-JV'!D17=0,\"\",LEFT('PJ-JV'!K17,50))","v":""},{"$f":"IF('PJ-JV'!D17=0,\"\",LEFT('PJ-JV'!L17,8))","v":""},{"$f":"IF('PJ-JV'!D17=0,\"\",LEFT('PJ-JV'!M17,10))","v":""},{"$f":"IF('PJ-JV'!D17=0,\"\",LEFT('PJ-JV'!N17,3))","v":""},{"$f":"IF('PJ-JV'!D17=0,\"\",LEFT('PJ-JV'!O17,6))","v":""},{"$f":"IF('PJ-JV'!D17=0,\"\",LEFT('PJ-JV'!P17,4))","v":""},{"$f":"IF('PJ-JV'!D17=0,\"\",LEFT('PJ-JV'!Q17,5))","v":""},{"$f":"IF('PJ-JV'!D17=0,\"\",LEFT('PJ-JV'!R17,4))","v":""},{"$f":"IF('PJ-JV'!D17=0,\"\",LEFT('PJ-JV'!S17,12))","v":""},{"$f":"IF('PJ-JV'!D17=0,\"\",LEFT('PJ-JV'!T17,12))","v":""},{"$f":"IF('PJ-JV'!D17=0,\"\",LEFT('PJ-JV'!U17,20))","v":""}]
[{"$f":"IF('PJ-JV'!D18=0,\"\",\"IT\")","v":""},null,{"$f":"IF('PJ-JV'!D18=0,\"\",'PJ-JV'!B18)","v":""},null,null,null,null,null,null,null,null,{"$f":"IF('PJ-JV'!D18=0,\"\",LEFT('PJ-JV'!C18,6))","v":""},{"$f":"IF('PJ-JV'!D18=0,\"\",ROUND('PJ-JV'!D18,2))","v":""},{"$f":"IF('PJ-JV'!D18=0,\"\",LEFT('PJ-JV'!E18,6))","v":""},{"$f":"IF('PJ-JV'!D18=0,\"\",PROPER(LEFT('PJ-JV'!F18,4)))","v":""},{"$f":"IF('PJ-JV'!D18=0,\"\",LEFT('PJ-JV'!G18,9))","v":""},{"$f":"IF('PJ-JV'!D18=0,\"\",LEFT('PJ-JV'!H18,6))","v":""},{"$f":"IF('PJ-JV'!D18=0,\"\",LEFT('PJ-JV'!I18,24))","v":""},{"$f":"IF('PJ-JV'!D18=0,\"\",LEFT('PJ-JV'!J18,18))","v":""},{"$f":"IF('PJ-JV'!D18=0,\"\",LEFT('PJ-JV'!K18,50))","v":""},{"$f":"IF('PJ-JV'!D18=0,\"\",LEFT('PJ-JV'!L18,8))","v":""},{"$f":"IF('PJ-JV'!D18=0,\"\",LEFT('PJ-JV'!M18,10))","v":""},{"$f":"IF('PJ-JV'!D18=0,\"\",LEFT('PJ-JV'!N18,3))","v":""},{"$f":"IF('PJ-JV'!D18=0,\"\",LEFT('PJ-JV'!O18,6))","v":""},{"$f":"IF('PJ-JV'!D18=0,\"\",LEFT('PJ-JV'!P18,4))","v":""},{"$f":"IF('PJ-JV'!D18=0,\"\",LEFT('PJ-JV'!Q18,5))","v":""},{"$f":"IF('PJ-JV'!D18=0,\"\",LEFT('PJ-JV'!R18,4))","v":""},{"$f":"IF('PJ-JV'!D18=0,\"\",LEFT('PJ-JV'!S18,12))","v":""},{"$f":"IF('PJ-JV'!D18=0,\"\",LEFT('PJ-JV'!T18,12))","v":""},{"$f":"IF('PJ-JV'!D18=0,\"\",LEFT('PJ-JV'!U18,20))","v":""}]
[{"$f":"IF('PJ-JV'!D19=0,\"\",\"IT\")","v":""},null,{"$f":"IF('PJ-JV'!D19=0,\"\",'PJ-JV'!B19)","v":""},null,null,null,null,null,null,null,null,{"$f":"IF('PJ-JV'!D19=0,\"\",LEFT('PJ-JV'!C19,6))","v":""},{"$f":"IF('PJ-JV'!D19=0,\"\",ROUND('PJ-JV'!D19,2))","v":""},{"$f":"IF('PJ-JV'!D19=0,\"\",LEFT('PJ-JV'!E19,6))","v":""},{"$f":"IF('PJ-JV'!D19=0,\"\",PROPER(LEFT('PJ-JV'!F19,4)))","v":""},{"$f":"IF('PJ-JV'!D19=0,\"\",LEFT('PJ-JV'!G19,9))","v":""},{"$f":"IF('PJ-JV'!D19=0,\"\",LEFT('PJ-JV'!H19,6))","v":""},{"$f":"IF('PJ-JV'!D19=0,\"\",LEFT('PJ-JV'!I19,24))","v":""},{"$f":"IF('PJ-JV'!D19=0,\"\",LEFT('PJ-JV'!J19,18))","v":""},{"$f":"IF('PJ-JV'!D19=0,\"\",LEFT('PJ-JV'!K19,50))","v":""},{"$f":"IF('PJ-JV'!D19=0,\"\",LEFT('PJ-JV'!L19,8))","v":""},{"$f":"IF('PJ-JV'!D19=0,\"\",LEFT('PJ-JV'!M19,10))","v":""},{"$f":"IF('PJ-JV'!D19=0,\"\",LEFT('PJ-JV'!N19,3))","v":""},{"$f":"IF('PJ-JV'!D19=0,\"\",LEFT('PJ-JV'!O19,6))","v":""},{"$f":"IF('PJ-JV'!D19=0,\"\",LEFT('PJ-JV'!P19,4))","v":""},{"$f":"IF('PJ-JV'!D19=0,\"\",LEFT('PJ-JV'!Q19,5))","v":""},{"$f":"IF('PJ-JV'!D19=0,\"\",LEFT('PJ-JV'!R19,4))","v":""},{"$f":"IF('PJ-JV'!D19=0,\"\",LEFT('PJ-JV'!S19,12))","v":""},{"$f":"IF('PJ-JV'!D19=0,\"\",LEFT('PJ-JV'!T19,12))","v":""},{"$f":"IF('PJ-JV'!D19=0,\"\",LEFT('PJ-JV'!U19,20))","v":""}]
[{"$f":"IF('PJ-JV'!D20=0,\"\",\"IT\")","v":""},null,{"$f":"IF('PJ-JV'!D20=0,\"\",'PJ-JV'!B20)","v":""},null,null,null,null,null,null,null,null,{"$f":"IF('PJ-JV'!D20=0,\"\",LEFT('PJ-JV'!C20,6))","v":""},{"$f":"IF('PJ-JV'!D20=0,\"\",ROUND('PJ-JV'!D20,2))","v":""},{"$f":"IF('PJ-JV'!D20=0,\"\",LEFT('PJ-JV'!E20,6))","v":""},{"$f":"IF('PJ-JV'!D20=0,\"\",PROPER(LEFT('PJ-JV'!F20,4)))","v":""},{"$f":"IF('PJ-JV'!D20=0,\"\",LEFT('PJ-JV'!G20,9))","v":""},{"$f":"IF('PJ-JV'!D20=0,\"\",LEFT('PJ-JV'!H20,6))","v":""},{"$f":"IF('PJ-JV'!D20=0,\"\",LEFT('PJ-JV'!I20,24))","v":""},{"$f":"IF('PJ-JV'!D20=0,\"\",LEFT('PJ-JV'!J20,18))","v":""},{"$f":"IF('PJ-JV'!D20=0,\"\",LEFT('PJ-JV'!K20,50))","v":""},{"$f":"IF('PJ-JV'!D20=0,\"\",LEFT('PJ-JV'!L20,8))","v":""},{"$f":"IF('PJ-JV'!D20=0,\"\",LEFT('PJ-JV'!M20,10))","v":""},{"$f":"IF('PJ-JV'!D20=0,\"\",LEFT('PJ-JV'!N20,3))","v":""},{"$f":"IF('PJ-JV'!D20=0,\"\",LEFT('PJ-JV'!O20,6))","v":""},{"$f":"IF('PJ-JV'!D20=0,\"\",LEFT('PJ-JV'!P20,4))","v":""},{"$f":"IF('PJ-JV'!D20=0,\"\",LEFT('PJ-JV'!Q20,5))","v":""},{"$f":"IF('PJ-JV'!D20=0,\"\",LEFT('PJ-JV'!R20,4))","v":""},{"$f":"IF('PJ-JV'!D20=0,\"\",LEFT('PJ-JV'!S20,12))","v":""},{"$f":"IF('PJ-JV'!D20=0,\"\",LEFT('PJ-JV'!T20,12))","v":""},{"$f":"IF('PJ-JV'!D20=0,\"\",LEFT('PJ-JV'!U20,20))","v":""}]
[{"$f":"IF('PJ-JV'!D21=0,\"\",\"IT\")","v":""},null,{"$f":"IF('PJ-JV'!D21=0,\"\",'PJ-JV'!B21)","v":""},null,null,null,null,null,null,null,null,{"$f":"IF('PJ-JV'!D21=0,\"\",LEFT('PJ-JV'!C21,6))","v":""},{"$f":"IF('PJ-JV'!D21=0,\"\",ROUND('PJ-JV'!D21,2))","v":""},{"$f":"IF('PJ-JV'!D21=0,\"\",LEFT('PJ-JV'!E21,6))","v":""},{"$f":"IF('PJ-JV'!D21=0,\"\",PROPER(LEFT('PJ-JV'!F21,4)))","v":""},{"$f":"IF('PJ-JV'!D21=0,\"\",LEFT('PJ-JV'!G21,9))","v":""},{"$f":"IF('PJ-JV'!D21=0,\"\",LEFT('PJ-JV'!H21,6))","v":""},{"$f":"IF('PJ-JV'!D21=0,\"\",LEFT('PJ-JV'!I21,24))","v":""},{"$f":"IF('PJ-JV'!D21=0,\"\",LEFT('PJ-JV'!J21,18))","v":""},{"$f":"IF('PJ-JV'!D21=0,\"\",LEFT('PJ-JV'!K21,50))","v":""},{"$f":"IF('PJ-JV'!D21=0,\"\",LEFT('PJ-JV'!L21,8))","v":""},{"$f":"IF('PJ-JV'!D21=0,\"\",LEFT('PJ-JV'!M21,10))","v":""},{"$f":"IF('PJ-JV'!D21=0,\"\",LEFT('PJ-JV'!N21,3))","v":""},{"$f":"IF('PJ-JV'!D21=0,\"\",LEFT('PJ-JV'!O21,6))","v":""},{"$f":"IF('PJ-JV'!D21=0,\"\",LEFT('PJ-JV'!P21,4))","v":""},{"$f":"IF('PJ-JV'!D21=0,\"\",LEFT('PJ-JV'!Q21,5))","v":""},{"$f":"IF('PJ-JV'!D21=0,\"\",LEFT('PJ-JV'!R21,4))","v":""},{"$f":"IF('PJ-JV'!D21=0,\"\",LEFT('PJ-JV'!S21,12))","v":""},{"$f":"IF('PJ-JV'!D21=0,\"\",LEFT('PJ-JV'!T21,12))","v":""},{"$f":"IF('PJ-JV'!D21=0,\"\",LEFT('PJ-JV'!U21,20))","v":""}]
[{"$f":"IF('PJ-JV'!D22=0,\"\",\"IT\")","v":""},null,{"$f":"IF('PJ-JV'!D22=0,\"\",'PJ-JV'!B22)","v":""},null,null,null,null,null,null,null,null,{"$f":"IF('PJ-JV'!D22=0,\"\",LEFT('PJ-JV'!C22,6))","v":""},{"$f":"IF('PJ-JV'!D22=0,\"\",ROUND('PJ-JV'!D22,2))","v":""},{"$f":"IF('PJ-JV'!D22=0,\"\",LEFT('PJ-JV'!E22,6))","v":""},{"$f":"IF('PJ-JV'!D22=0,\"\",PROPER(LEFT('PJ-JV'!F22,4)))","v":""},{"$f":"IF('PJ-JV'!D22=0,\"\",LEFT('PJ-JV'!G22,9))","v":""},{"$f":"IF('PJ-JV'!D22=0,\"\",LEFT('PJ-JV'!H22,6))","v":""},{"$f":"IF('PJ-JV'!D22=0,\"\",LEFT('PJ-JV'!I22,24))","v":""},{"$f":"IF('PJ-JV'!D22=0,\"\",LEFT('PJ-JV'!J22,18))","v":""},{"$f":"IF('PJ-JV'!D22=0,\"\",LEFT('PJ-JV'!K22,50))","v":""},{"$f":"IF('PJ-JV'!D22=0,\"\",LEFT('PJ-JV'!L22,8))","v":""},{"$f":"IF('PJ-JV'!D22=0,\"\",LEFT('PJ-JV'!M22,10))","v":""},{"$f":"IF('PJ-JV'!D22=0,\"\",LEFT('PJ-JV'!N22,3))","v":""},{"$f":"IF('PJ-JV'!D22=0,\"\",LEFT('PJ-JV'!O22,6))","v":""},{"$f":"IF('PJ-JV'!D22=0,\"\",LEFT('PJ-JV'!P22,4))","v":""},{"$f":"IF('PJ-JV'!D22=0,\"\",LEFT('PJ-JV'!Q22,5))","v":""},{"$f":"IF('PJ-JV'!D22=0,\"\",LEFT('PJ-JV'!R22,4))","v":""},{"$f":"IF('PJ-JV'!D22=0,\"\",LEFT('PJ-JV'!S22,12))","v":""},{"$f":"IF('PJ-JV'!D22=0,\"\",LEFT('PJ-JV'!T22,12))","v":""},{"$f":"IF('PJ-JV'!D22=0,\"\",LEFT('PJ-JV'!U22,20))","v":""}]
[{"$f":"IF('PJ-JV'!D23=0,\"\",\"IT\")","v":""},null,{"$f":"IF('PJ-JV'!D23=0,\"\",'PJ-JV'!B23)","v":""},null,null,null,null,null,null,null,null,{"$f":"IF('PJ-JV'!D23=0,\"\",LEFT('PJ-JV'!C23,6))","v":""},{"$f":"IF('PJ-JV'!D23=0,\"\",ROUND('PJ-JV'!D23,2))","v":""},{"$f":"IF('PJ-JV'!D23=0,\"\",LEFT('PJ-JV'!E23,6))","v":""},{"$f":"IF('PJ-JV'!D23=0,\"\",PROPER(LEFT('PJ-JV'!F23,4)))","v":""},{"$f":"IF('PJ-JV'!D23=0,\"\",LEFT('PJ-JV'!G23,9))","v":""},{"$f":"IF('PJ-JV'!D23=0,\"\",LEFT('PJ-JV'!H23,6))","v":""},{"$f":"IF('PJ-JV'!D23=0,\"\",LEFT('PJ-JV'!I23,24))","v":""},{"$f":"IF('PJ-JV'!D23=0,\"\",LEFT('PJ-JV'!J23,18))","v":""},{"$f":"IF('PJ-JV'!D23=0,\"\",LEFT('PJ-JV'!K23,50))","v":""},{"$f":"IF('PJ-JV'!D23=0,\"\",LEFT('PJ-JV'!L23,8))","v":""},{"$f":"IF('PJ-JV'!D23=0,\"\",LEFT('PJ-JV'!M23,10))","v":""},{"$f":"IF('PJ-JV'!D23=0,\"\",LEFT('PJ-JV'!N23,3))","v":""},{"$f":"IF('PJ-JV'!D23=0,\"\",LEFT('PJ-JV'!O23,6))","v":""},{"$f":"IF('PJ-JV'!D23=0,\"\",LEFT('PJ-JV'!P23,4))","v":""},{"$f":"IF('PJ-JV'!D23=0,\"\",LEFT('PJ-JV'!Q23,5))","v":""},{"$f":"IF('PJ-JV'!D23=0,\"\",LEFT('PJ-JV'!R23,4))","v":""},{"$f":"IF('PJ-JV'!D23=0,\"\",LEFT('PJ-JV'!S23,12))","v":""},{"$f":"IF('PJ-JV'!D23=0,\"\",LEFT('PJ-JV'!T23,12))","v":""},{"$f":"IF('PJ-JV'!D23=0,\"\",LEFT('PJ-JV'!U23,20))","v":""}]
[{"$f":"IF('PJ-JV'!D24=0,\"\",\"IT\")","v":""},null,{"$f":"IF('PJ-JV'!D24=0,\"\",'PJ-JV'!B24)","v":""},null,null,null,null,null,null,null,null,{"$f":"IF('PJ-JV'!D24=0,\"\",LEFT('PJ-JV'!C24,6))","v":""},{"$f":"IF('PJ-JV'!D24=0,\"\",ROUND('PJ-JV'!D24,2))","v":""},{"$f":"IF('PJ-JV'!D24=0,\"\",LEFT('PJ-JV'!E24,6))","v":""},{"$f":"IF('PJ-JV'!D24=0,\"\",PROPER(LEFT('PJ-JV'!F24,4)))","v":""},{"$f":"IF('PJ-JV'!D24=0,\"\",LEFT('PJ-JV'!G24,9))","v":""},{"$f":"IF('PJ-JV'!D24=0,\"\",LEFT('PJ-JV'!H24,6))","v":""},{"$f":"IF('PJ-JV'!D24=0,\"\",LEFT('PJ-JV'!I24,24))","v":""},{"$f":"IF('PJ-JV'!D24=0,\"\",LEFT('PJ-JV'!J24,18))","v":""},{"$f":"IF('PJ-JV'!D24=0,\"\",LEFT('PJ-JV'!K24,50))","v":""},{"$f":"IF('PJ-JV'!D24=0,\"\",LEFT('PJ-JV'!L24,8))","v":""},{"$f":"IF('PJ-JV'!D24=0,\"\",LEFT('PJ-JV'!M24,10))","v":""},{"$f":"IF('PJ-JV'!D24=0,\"\",LEFT('PJ-JV'!N24,3))","v":""},{"$f":"IF('PJ-JV'!D24=0,\"\",LEFT('PJ-JV'!O24,6))","v":""},{"$f":"IF('PJ-JV'!D24=0,\"\",LEFT('PJ-JV'!P24,4))","v":""},{"$f":"IF('PJ-JV'!D24=0,\"\",LEFT('PJ-JV'!Q24,5))","v":""},{"$f":"IF('PJ-JV'!D24=0,\"\",LEFT('PJ-JV'!R24,4))","v":""},{"$f":"IF('PJ-JV'!D24=0,\"\",LEFT('PJ-JV'!S24,12))","v":""},{"$f":"IF('PJ-JV'!D24=0,\"\",LEFT('PJ-JV'!T24,12))","v":""},{"$f":"IF('PJ-JV'!D24=0,\"\",LEFT('PJ-JV'!U24,20))","v":""}]
[{"$f":"IF('PJ-JV'!D25=0,\"\",\"IT\")","v":""},null,{"$f":"IF('PJ-JV'!D25=0,\"\",'PJ-JV'!B25)","v":""},null,null,null,null,null,null,null,null,{"$f":"IF('PJ-JV'!D25=0,\"\",LEFT('PJ-JV'!C25,6))","v":""},{"$f":"IF('PJ-JV'!D25=0,\"\",ROUND('PJ-JV'!D25,2))","v":""},{"$f":"IF('PJ-JV'!D25=0,\"\",LEFT('PJ-JV'!E25,6))","v":""},{"$f":"IF('PJ-JV'!D25=0,\"\",PROPER(LEFT('PJ-JV'!F25,4)))","v":""},{"$f":"IF('PJ-JV'!D25=0,\"\",LEFT('PJ-JV'!G25,9))","v":""},{"$f":"IF('PJ-JV'!D25=0,\"\",LEFT('PJ-JV'!H25,6))","v":""},{"$f":"IF('PJ-JV'!D25=0,\"\",LEFT('PJ-JV'!I25,24))","v":""},{"$f":"IF('PJ-JV'!D25=0,\"\",LEFT('PJ-JV'!J25,18))","v":""},{"$f":"IF('PJ-JV'!D25=0,\"\",LEFT('PJ-JV'!K25,50))","v":""},{"$f":"IF('PJ-JV'!D25=0,\"\",LEFT('PJ-JV'!L25,8))","v":""},{"$f":"IF('PJ-JV'!D25=0,\"\",LEFT('PJ-JV'!M25,10))","v":""},{"$f":"IF('PJ-JV'!D25=0,\"\",LEFT('PJ-JV'!N25,3))","v":""},{"$f":"IF('PJ-JV'!D25=0,\"\",LEFT('PJ-JV'!O25,6))","v":""},{"$f":"IF('PJ-JV'!D25=0,\"\",LEFT('PJ-JV'!P25,4))","v":""},{"$f":"IF('PJ-JV'!D25=0,\"\",LEFT('PJ-JV'!Q25,5))","v":""},{"$f":"IF('PJ-JV'!D25=0,\"\",LEFT('PJ-JV'!R25,4))","v":""},{"$f":"IF('PJ-JV'!D25=0,\"\",LEFT('PJ-JV'!S25,12))","v":""},{"$f":"IF('PJ-JV'!D25=0,\"\",LEFT('PJ-JV'!T25,12))","v":""},{"$f":"IF('PJ-JV'!D25=0,\"\",LEFT('PJ-JV'!U25,20))","v":""}]
[{"$f":"IF('PJ-JV'!D26=0,\"\",\"IT\")","v":""},null,{"$f":"IF('PJ-JV'!D26=0,\"\",'PJ-JV'!B26)","v":""},null,null,null,null,null,null,null,null,{"$f":"IF('PJ-JV'!D26=0,\"\",LEFT('PJ-JV'!C26,6))","v":""},{"$f":"IF('PJ-JV'!D26=0,\"\",ROUND('PJ-JV'!D26,2))","v":""},{"$f":"IF('PJ-JV'!D26=0,\"\",LEFT('PJ-JV'!E26,6))","v":""},{"$f":"IF('PJ-JV'!D26=0,\"\",PROPER(LEFT('PJ-JV'!F26,4)))","v":""},{"$f":"IF('PJ-JV'!D26=0,\"\",LEFT('PJ-JV'!G26,9))","v":""},{"$f":"IF('PJ-JV'!D26=0,\"\",LEFT('PJ-JV'!H26,6))","v":""},{"$f":"IF('PJ-JV'!D26=0,\"\",LEFT('PJ-JV'!I26,24))","v":""},{"$f":"IF('PJ-JV'!D26=0,\"\",LEFT('PJ-JV'!J26,18))","v":""},{"$f":"IF('PJ-JV'!D26=0,\"\",LEFT('PJ-JV'!K26,50))","v":""},{"$f":"IF('PJ-JV'!D26=0,\"\",LEFT('PJ-JV'!L26,8))","v":""},{"$f":"IF('PJ-JV'!D26=0,\"\",LEFT('PJ-JV'!M26,10))","v":""},{"$f":"IF('PJ-JV'!D26=0,\"\",LEFT('PJ-JV'!N26,3))","v":""},{"$f":"IF('PJ-JV'!D26=0,\"\",LEFT('PJ-JV'!O26,6))","v":""},{"$f":"IF('PJ-JV'!D26=0,\"\",LEFT('PJ-JV'!P26,4))","v":""},{"$f":"IF('PJ-JV'!D26=0,\"\",LEFT('PJ-JV'!Q26,5))","v":""},{"$f":"IF('PJ-JV'!D26=0,\"\",LEFT('PJ-JV'!R26,4))","v":""},{"$f":"IF('PJ-JV'!D26=0,\"\",LEFT('PJ-JV'!S26,12))","v":""},{"$f":"IF('PJ-JV'!D26=0,\"\",LEFT('PJ-JV'!T26,12))","v":""},{"$f":"IF('PJ-JV'!D26=0,\"\",LEFT('PJ-JV'!U26,20))","v":""}]
[{"$f":"IF('PJ-JV'!D27=0,\"\",\"IT\")","v":""},null,{"$f":"IF('PJ-JV'!D27=0,\"\",'PJ-JV'!B27)","v":""},null,null,null,null,null,null,null,null,{"$f":"IF('PJ-JV'!D27=0,\"\",LEFT('PJ-JV'!C27,6))","v":""},{"$f":"IF('PJ-JV'!D27=0,\"\",ROUND('PJ-JV'!D27,2))","v":""},{"$f":"IF('PJ-JV'!D27=0,\"\",LEFT('PJ-JV'!E27,6))","v":""},{"$f":"IF('PJ-JV'!D27=0,\"\",PROPER(LEFT('PJ-JV'!F27,4)))","v":""},{"$f":"IF('PJ-JV'!D27=0,\"\",LEFT('PJ-JV'!G27,9))","v":""},{"$f":"IF('PJ-JV'!D27=0,\"\",LEFT('PJ-JV'!H27,6))","v":""},{"$f":"IF('PJ-JV'!D27=0,\"\",LEFT('PJ-JV'!I27,24))","v":""},{"$f":"IF('PJ-JV'!D27=0,\"\",LEFT('PJ-JV'!J27,18))","v":""},{"$f":"IF('PJ-JV'!D27=0,\"\",LEFT('PJ-JV'!K27,50))","v":""},{"$f":"IF('PJ-JV'!D27=0,\"\",LEFT('PJ-JV'!L27,8))","v":""},{"$f":"IF('PJ-JV'!D27=0,\"\",LEFT('PJ-JV'!M27,10))","v":""},{"$f":"IF('PJ-JV'!D27=0,\"\",LEFT('PJ-JV'!N27,3))","v":""},{"$f":"IF('PJ-JV'!D27=0,\"\",LEFT('PJ-JV'!O27,6))","v":""},{"$f":"IF('PJ-JV'!D27=0,\"\",LEFT('PJ-JV'!P27,4))","v":""},{"$f":"IF('PJ-JV'!D27=0,\"\",LEFT('PJ-JV'!Q27,5))","v":""},{"$f":"IF('PJ-JV'!D27=0,\"\",LEFT('PJ-JV'!R27,4))","v":""},{"$f":"IF('PJ-JV'!D27=0,\"\",LEFT('PJ-JV'!S27,12))","v":""},{"$f":"IF('PJ-JV'!D27=0,\"\",LEFT('PJ-JV'!T27,12))","v":""},{"$f":"IF('PJ-JV'!D27=0,\"\",LEFT('PJ-JV'!U27,20))","v":""}]
[{"$f":"IF('PJ-JV'!D28=0,\"\",\"IT\")","v":""},null,{"$f":"IF('PJ-JV'!D28=0,\"\",'PJ-JV'!B28)","v":""},null,null,null,null,null,null,null,null,{"$f":"IF('PJ-JV'!D28=0,\"\",LEFT('PJ-JV'!C28,6))","v":""},{"$f":"IF('PJ-JV'!D28=0,\"\",ROUND('PJ-JV'!D28,2))","v":""},{"$f":"IF('PJ-JV'!D28=0,\"\",LEFT('PJ-JV'!E28,6))","v":""},{"$f":"IF('PJ-JV'!D28=0,\"\",PROPER(LEFT('PJ-JV'!F28,4)))","v":""},{"$f":"IF('PJ-JV'!D28=0,\"\",LEFT('PJ-JV'!G28,9))","v":""},{"$f":"IF('PJ-JV'!D28=0,\"\",LEFT('PJ-JV'!H28,6))","v":""},{"$f":"IF('PJ-JV'!D28=0,\"\",LEFT('PJ-JV'!I28,24))","v":""},{"$f":"IF('PJ-JV'!D28=0,\"\",LEFT('PJ-JV'!J28,18))","v":""},{"$f":"IF('PJ-JV'!D28=0,\"\",LEFT('PJ-JV'!K28,50))","v":""},{"$f":"IF('PJ-JV'!D28=0,\"\",LEFT('PJ-JV'!L28,8))","v":""},{"$f":"IF('PJ-JV'!D28=0,\"\",LEFT('PJ-JV'!M28,10))","v":""},{"$f":"IF('PJ-JV'!D28=0,\"\",LEFT('PJ-JV'!N28,3))","v":""},{"$f":"IF('PJ-JV'!D28=0,\"\",LEFT('PJ-JV'!O28,6))","v":""},{"$f":"IF('PJ-JV'!D28=0,\"\",LEFT('PJ-JV'!P28,4))","v":""},{"$f":"IF('PJ-JV'!D28=0,\"\",LEFT('PJ-JV'!Q28,5))","v":""},{"$f":"IF('PJ-JV'!D28=0,\"\",LEFT('PJ-JV'!R28,4))","v":""},{"$f":"IF('PJ-JV'!D28=0,\"\",LEFT('PJ-JV'!S28,12))","v":""},{"$f":"IF('PJ-JV'!D28=0,\"\",LEFT('PJ-JV'!T28,12))","v":""},{"$f":"IF('PJ-JV'!D28=0,\"\",LEFT('PJ-JV'!U28,20))","v":""}]
[{"$f":"IF('PJ-JV'!D29=0,\"\",\"IT\")","v":""},null,{"$f":"IF('PJ-JV'!D29=0,\"\",'PJ-JV'!B29)","v":""},null,null,null,null,null,null,null,null,{"$f":"IF('PJ-JV'!D29=0,\"\",LEFT('PJ-JV'!C29,6))","v":""},{"$f":"IF('PJ-JV'!D29=0,\"\",ROUND('PJ-JV'!D29,2))","v":""},{"$f":"IF('PJ-JV'!D29=0,\"\",LEFT('PJ-JV'!E29,6))","v":""},{"$f":"IF('PJ-JV'!D29=0,\"\",PROPER(LEFT('PJ-JV'!F29,4)))","v":""},{"$f":"IF('PJ-JV'!D29=0,\"\",LEFT('PJ-JV'!G29,9))","v":""},{"$f":"IF('PJ-JV'!D29=0,\"\",LEFT('PJ-JV'!H29,6))","v":""},{"$f":"IF('PJ-JV'!D29=0,\"\",LEFT('PJ-JV'!I29,24))","v":""},{"$f":"IF('PJ-JV'!D29=0,\"\",LEFT('PJ-JV'!J29,18))","v":""},{"$f":"IF('PJ-JV'!D29=0,\"\",LEFT('PJ-JV'!K29,50))","v":""},{"$f":"IF('PJ-JV'!D29=0,\"\",LEFT('PJ-JV'!L29,8))","v":""},{"$f":"IF('PJ-JV'!D29=0,\"\",LEFT('PJ-JV'!M29,10))","v":""},{"$f":"IF('PJ-JV'!D29=0,\"\",LEFT('PJ-JV'!N29,3))","v":""},{"$f":"IF('PJ-JV'!D29=0,\"\",LEFT('PJ-JV'!O29,6))","v":""},{"$f":"IF('PJ-JV'!D29=0,\"\",LEFT('PJ-JV'!P29,4))","v":""},{"$f":"IF('PJ-JV'!D29=0,\"\",LEFT('PJ-JV'!Q29,5))","v":""},{"$f":"IF('PJ-JV'!D29=0,\"\",LEFT('PJ-JV'!R29,4))","v":""},{"$f":"IF('PJ-JV'!D29=0,\"\",LEFT('PJ-JV'!S29,12))","v":""},{"$f":"IF('PJ-JV'!D29=0,\"\",LEFT('PJ-JV'!T29,12))","v":""},{"$f":"IF('PJ-JV'!D29=0,\"\",LEFT('PJ-JV'!U29,20))","v":""}]
[{"$f":"IF('PJ-JV'!D30=0,\"\",\"IT\")","v":""},null,{"$f":"IF('PJ-JV'!D30=0,\"\",'PJ-JV'!B30)","v":""},null,null,null,null,null,null,null,null,{"$f":"IF('PJ-JV'!D30=0,\"\",LEFT('PJ-JV'!C30,6))","v":""},{"$f":"IF('PJ-JV'!D30=0,\"\",ROUND('PJ-JV'!D30,2))","v":""},{"$f":"IF('PJ-JV'!D30=0,\"\",LEFT('PJ-JV'!E30,6))","v":""},{"$f":"IF('PJ-JV'!D30=0,\"\",PROPER(LEFT('PJ-JV'!F30,4)))","v":""},{"$f":"IF('PJ-JV'!D30=0,\"\",LEFT('PJ-JV'!G30,9))","v":""},{"$f":"IF('PJ-JV'!D30=0,\"\",LEFT('PJ-JV'!H30,6))","v":""},{"$f":"IF('PJ-JV'!D30=0,\"\",LEFT('PJ-JV'!I30,24))","v":""},{"$f":"IF('PJ-JV'!D30=0,\"\",LEFT('PJ-JV'!J30,18))","v":""},{"$f":"IF('PJ-JV'!D30=0,\"\",LEFT('PJ-JV'!K30,50))","v":""},{"$f":"IF('PJ-JV'!D30=0,\"\",LEFT('PJ-JV'!L30,8))","v":""},{"$f":"IF('PJ-JV'!D30=0,\"\",LEFT('PJ-JV'!M30,10))","v":""},{"$f":"IF('PJ-JV'!D30=0,\"\",LEFT('PJ-JV'!N30,3))","v":""},{"$f":"IF('PJ-JV'!D30=0,\"\",LEFT('PJ-JV'!O30,6))","v":""},{"$f":"IF('PJ-JV'!D30=0,\"\",LEFT('PJ-JV'!P30,4))","v":""},{"$f":"IF('PJ-JV'!D30=0,\"\",LEFT('PJ-JV'!Q30,5))","v":""},{"$f":"IF('PJ-JV'!D30=0,\"\",LEFT('PJ-JV'!R30,4))","v":""},{"$f":"IF('PJ-JV'!D30=0,\"\",LEFT('PJ-JV'!S30,12))","v":""},{"$f":"IF('PJ-JV'!D30=0,\"\",LEFT('PJ-JV'!T30,12))","v":""},{"$f":"IF('PJ-JV'!D30=0,\"\",LEFT('PJ-JV'!U30,20))","v":""}]
[{"$f":"IF('PJ-JV'!D31=0,\"\",\"IT\")","v":""},null,{"$f":"IF('PJ-JV'!D31=0,\"\",'PJ-JV'!B31)","v":""},null,null,null,null,null,null,null,null,{"$f":"IF('PJ-JV'!D31=0,\"\",LEFT('PJ-JV'!C31,6))","v":""},{"$f":"IF('PJ-JV'!D31=0,\"\",ROUND('PJ-JV'!D31,2))","v":""},{"$f":"IF('PJ-JV'!D31=0,\"\",LEFT('PJ-JV'!E31,6))","v":""},{"$f":"IF('PJ-JV'!D31=0,\"\",PROPER(LEFT('PJ-JV'!F31,4)))","v":""},{"$f":"IF('PJ-JV'!D31=0,\"\",LEFT('PJ-JV'!G31,9))","v":""},{"$f":"IF('PJ-JV'!D31=0,\"\",LEFT('PJ-JV'!H31,6))","v":""},{"$f":"IF('PJ-JV'!D31=0,\"\",LEFT('PJ-JV'!I31,24))","v":""},{"$f":"IF('PJ-JV'!D31=0,\"\",LEFT('PJ-JV'!J31,18))","v":""},{"$f":"IF('PJ-JV'!D31=0,\"\",LEFT('PJ-JV'!K31,50))","v":""},{"$f":"IF('PJ-JV'!D31=0,\"\",LEFT('PJ-JV'!L31,8))","v":""},{"$f":"IF('PJ-JV'!D31=0,\"\",LEFT('PJ-JV'!M31,10))","v":""},{"$f":"IF('PJ-JV'!D31=0,\"\",LEFT('PJ-JV'!N31,3))","v":""},{"$f":"IF('PJ-JV'!D31=0,\"\",LEFT('PJ-JV'!O31,6))","v":""},{"$f":"IF('PJ-JV'!D31=0,\"\",LEFT('PJ-JV'!P31,4))","v":""},{"$f":"IF('PJ-JV'!D31=0,\"\",LEFT('PJ-JV'!Q31,5))","v":""},{"$f":"IF('PJ-JV'!D31=0,\"\",LEFT('PJ-JV'!R31,4))","v":""},{"$f":"IF('PJ-JV'!D31=0,\"\",LEFT('PJ-JV'!S31,12))","v":""},{"$f":"IF('PJ-JV'!D31=0,\"\",LEFT('PJ-JV'!T31,12))","v":""},{"$f":"IF('PJ-JV'!D31=0,\"\",LEFT('PJ-JV'!U31,20))","v":""}]
[{"$f":"IF('PJ-JV'!D32=0,\"\",\"IT\")","v":""},null,{"$f":"IF('PJ-JV'!D32=0,\"\",'PJ-JV'!B32)","v":""},null,null,null,null,null,null,null,null,{"$f":"IF('PJ-JV'!D32=0,\"\",LEFT('PJ-JV'!C32,6))","v":""},{"$f":"IF('PJ-JV'!D32=0,\"\",ROUND('PJ-JV'!D32,2))","v":""},{"$f":"IF('PJ-JV'!D32=0,\"\",LEFT('PJ-JV'!E32,6))","v":""},{"$f":"IF('PJ-JV'!D32=0,\"\",PROPER(LEFT('PJ-JV'!F32,4)))","v":""},{"$f":"IF('PJ-JV'!D32=0,\"\",LEFT('PJ-JV'!G32,9))","v":""},{"$f":"IF('PJ-JV'!D32=0,\"\",LEFT('PJ-JV'!H32,6))","v":""},{"$f":"IF('PJ-JV'!D32=0,\"\",LEFT('PJ-JV'!I32,24))","v":""},{"$f":"IF('PJ-JV'!D32=0,\"\",LEFT('PJ-JV'!J32,18))","v":""},{"$f":"IF('PJ-JV'!D32=0,\"\",LEFT('PJ-JV'!K32,50))","v":""},{"$f":"IF('PJ-JV'!D32=0,\"\",LEFT('PJ-JV'!L32,8))","v":""},{"$f":"IF('PJ-JV'!D32=0,\"\",LEFT('PJ-JV'!M32,10))","v":""},{"$f":"IF('PJ-JV'!D32=0,\"\",LEFT('PJ-JV'!N32,3))","v":""},{"$f":"IF('PJ-JV'!D32=0,\"\",LEFT('PJ-JV'!O32,6))","v":""},{"$f":"IF('PJ-JV'!D32=0,\"\",LEFT('PJ-JV'!P32,4))","v":""},{"$f":"IF('PJ-JV'!D32=0,\"\",LEFT('PJ-JV'!Q32,5))","v":""},{"$f":"IF('PJ-JV'!D32=0,\"\",LEFT('PJ-JV'!R32,4))","v":""},{"$f":"IF('PJ-JV'!D32=0,\"\",LEFT('PJ-JV'!S32,12))","v":""},{"$f":"IF('PJ-JV'!D32=0,\"\",LEFT('PJ-JV'!T32,12))","v":""},{"$f":"IF('PJ-JV'!D32=0,\"\",LEFT('PJ-JV'!U32,20))","v":""}]
[{"$f":"IF('PJ-JV'!D33=0,\"\",\"IT\")","v":""},null,{"$f":"IF('PJ-JV'!D33=0,\"\",'PJ-JV'!B33)","v":""},null,null,null,null,null,null,null,null,{"$f":"IF('PJ-JV'!D33=0,\"\",LEFT('PJ-JV'!C33,6))","v":""},{"$f":"IF('PJ-JV'!D33=0,\"\",ROUND('PJ-JV'!D33,2))","v":""},{"$f":"IF('PJ-JV'!D33=0,\"\",LEFT('PJ-JV'!E33,6))","v":""},{"$f":"IF('PJ-JV'!D33=0,\"\",PROPER(LEFT('PJ-JV'!F33,4)))","v":""},{"$f":"IF('PJ-JV'!D33=0,\"\",LEFT('PJ-JV'!G33,9))","v":""},{"$f":"IF('PJ-JV'!D33=0,\"\",LEFT('PJ-JV'!H33,6))","v":""},{"$f":"IF('PJ-JV'!D33=0,\"\",LEFT('PJ-JV'!I33,24))","v":""},{"$f":"IF('PJ-JV'!D33=0,\"\",LEFT('PJ-JV'!J33,18))","v":""},{"$f":"IF('PJ-JV'!D33=0,\"\",LEFT('PJ-JV'!K33,50))","v":""},{"$f":"IF('PJ-JV'!D33=0,\"\",LEFT('PJ-JV'!L33,8))","v":""},{"$f":"IF('PJ-JV'!D33=0,\"\",LEFT('PJ-JV'!M33,10))","v":""},{"$f":"IF('PJ-JV'!D33=0,\"\",LEFT('PJ-JV'!N33,3))","v":""},{"$f":"IF('PJ-JV'!D33=0,\"\",LEFT('PJ-JV'!O33,6))","v":""},{"$f":"IF('PJ-JV'!D33=0,\"\",LEFT('PJ-JV'!P33,4))","v":""},{"$f":"IF('PJ-JV'!D33=0,\"\",LEFT('PJ-JV'!Q33,5))","v":""},{"$f":"IF('PJ-JV'!D33=0,\"\",LEFT('PJ-JV'!R33,4))","v":""},{"$f":"IF('PJ-JV'!D33=0,\"\",LEFT('PJ-JV'!S33,12))","v":""},{"$f":"IF('PJ-JV'!D33=0,\"\",LEFT('PJ-JV'!T33,12))","v":""},{"$f":"IF('PJ-JV'!D33=0,\"\",LEFT('PJ-JV'!U33,20))","v":""}]
[{"$f":"IF('PJ-JV'!D34=0,\"\",\"IT\")","v":""},null,{"$f":"IF('PJ-JV'!D34=0,\"\",'PJ-JV'!B34)","v":""},null,null,null,null,null,null,null,null,{"$f":"IF('PJ-JV'!D34=0,\"\",LEFT('PJ-JV'!C34,6))","v":""},{"$f":"IF('PJ-JV'!D34=0,\"\",ROUND('PJ-JV'!D34,2))","v":""},{"$f":"IF('PJ-JV'!D34=0,\"\",LEFT('PJ-JV'!E34,6))","v":""},{"$f":"IF('PJ-JV'!D34=0,\"\",PROPER(LEFT('PJ-JV'!F34,4)))","v":""},{"$f":"IF('PJ-JV'!D34=0,\"\",LEFT('PJ-JV'!G34,9))","v":""},{"$f":"IF('PJ-JV'!D34=0,\"\",LEFT('PJ-JV'!H34,6))","v":""},{"$f":"IF('PJ-JV'!D34=0,\"\",LEFT('PJ-JV'!I34,24))","v":""},{"$f":"IF('PJ-JV'!D34=0,\"\",LEFT('PJ-JV'!J34,18))","v":""},{"$f":"IF('PJ-JV'!D34=0,\"\",LEFT('PJ-JV'!K34,50))","v":""},{"$f":"IF('PJ-JV'!D34=0,\"\",LEFT('PJ-JV'!L34,8))","v":""},{"$f":"IF('PJ-JV'!D34=0,\"\",LEFT('PJ-JV'!M34,10))","v":""},{"$f":"IF('PJ-JV'!D34=0,\"\",LEFT('PJ-JV'!N34,3))","v":""},{"$f":"IF('PJ-JV'!D34=0,\"\",LEFT('PJ-JV'!O34,6))","v":""},{"$f":"IF('PJ-JV'!D34=0,\"\",LEFT('PJ-JV'!P34,4))","v":""},{"$f":"IF('PJ-JV'!D34=0,\"\",LEFT('PJ-JV'!Q34,5))","v":""},{"$f":"IF('PJ-JV'!D34=0,\"\",LEFT('PJ-JV'!R34,4))","v":""},{"$f":"IF('PJ-JV'!D34=0,\"\",LEFT('PJ-JV'!S34,12))","v":""},{"$f":"IF('PJ-JV'!D34=0,\"\",LEFT('PJ-JV'!T34,12))","v":""},{"$f":"IF('PJ-JV'!D34=0,\"\",LEFT('PJ-JV'!U34,20))","v":""}]
[{"$f":"IF('PJ-JV'!D35=0,\"\",\"IT\")","v":""},null,{"$f":"IF('PJ-JV'!D35=0,\"\",'PJ-JV'!B35)","v":""},null,null,null,null,null,null,null,null,{"$f":"IF('PJ-JV'!D35=0,\"\",LEFT('PJ-JV'!C35,6))","v":""},{"$f":"IF('PJ-JV'!D35=0,\"\",ROUND('PJ-JV'!D35,2))","v":""},{"$f":"IF('PJ-JV'!D35=0,\"\",LEFT('PJ-JV'!E35,6))","v":""},{"$f":"IF('PJ-JV'!D35=0,\"\",PROPER(LEFT('PJ-JV'!F35,4)))","v":""},{"$f":"IF('PJ-JV'!D35=0,\"\",LEFT('PJ-JV'!G35,9))","v":""},{"$f":"IF('PJ-JV'!D35=0,\"\",LEFT('PJ-JV'!H35,6))","v":""},{"$f":"IF('PJ-JV'!D35=0,\"\",LEFT('PJ-JV'!I35,24))","v":""},{"$f":"IF('PJ-JV'!D35=0,\"\",LEFT('PJ-JV'!J35,18))","v":""},{"$f":"IF('PJ-JV'!D35=0,\"\",LEFT('PJ-JV'!K35,50))","v":""},{"$f":"IF('PJ-JV'!D35=0,\"\",LEFT('PJ-JV'!L35,8))","v":""},{"$f":"IF('PJ-JV'!D35=0,\"\",LEFT('PJ-JV'!M35,10))","v":""},{"$f":"IF('PJ-JV'!D35=0,\"\",LEFT('PJ-JV'!N35,3))","v":""},{"$f":"IF('PJ-JV'!D35=0,\"\",LEFT('PJ-JV'!O35,6))","v":""},{"$f":"IF('PJ-JV'!D35=0,\"\",LEFT('PJ-JV'!P35,4))","v":""},{"$f":"IF('PJ-JV'!D35=0,\"\",LEFT('PJ-JV'!Q35,5))","v":""},{"$f":"IF('PJ-JV'!D35=0,\"\",LEFT('PJ-JV'!R35,4))","v":""},{"$f":"IF('PJ-JV'!D35=0,\"\",LEFT('PJ-JV'!S35,12))","v":""},{"$f":"IF('PJ-JV'!D35=0,\"\",LEFT('PJ-JV'!T35,12))","v":""},{"$f":"IF('PJ-JV'!D35=0,\"\",LEFT('PJ-JV'!U35,20))","v":""}]
[{"$f":"IF('PJ-JV'!D36=0,\"\",\"IT\")","v":""},null,{"$f":"IF('PJ-JV'!D36=0,\"\",'PJ-JV'!B36)","v":""},null,null,null,null,null,null,null,null,{"$f":"IF('PJ-JV'!D36=0,\"\",LEFT('PJ-JV'!C36,6))","v":""},{"$f":"IF('PJ-JV'!D36=0,\"\",ROUND('PJ-JV'!D36,2))","v":""},{"$f":"IF('PJ-JV'!D36=0,\"\",LEFT('PJ-JV'!E36,6))","v":""},{"$f":"IF('PJ-JV'!D36=0,\"\",PROPER(LEFT('PJ-JV'!F36,4)))","v":""},{"$f":"IF('PJ-JV'!D36=0,\"\",LEFT('PJ-JV'!G36,9))","v":""},{"$f":"IF('PJ-JV'!D36=0,\"\",LEFT('PJ-JV'!H36,6))","v":""},{"$f":"IF('PJ-JV'!D36=0,\"\",LEFT('PJ-JV'!I36,24))","v":""},{"$f":"IF('PJ-JV'!D36=0,\"\",LEFT('PJ-JV'!J36,18))","v":""},{"$f":"IF('PJ-JV'!D36=0,\"\",LEFT('PJ-JV'!K36,50))","v":""},{"$f":"IF('PJ-JV'!D36=0,\"\",LEFT('PJ-JV'!L36,8))","v":""},{"$f":"IF('PJ-JV'!D36=0,\"\",LEFT('PJ-JV'!M36,10))","v":""},{"$f":"IF('PJ-JV'!D36=0,\"\",LEFT('PJ-JV'!N36,3))","v":""},{"$f":"IF('PJ-JV'!D36=0,\"\",LEFT('PJ-JV'!O36,6))","v":""},{"$f":"IF('PJ-JV'!D36=0,\"\",LEFT('PJ-JV'!P36,4))","v":""},{"$f":"IF('PJ-JV'!D36=0,\"\",LEFT('PJ-JV'!Q36,5))","v":""},{"$f":"IF('PJ-JV'!D36=0,\"\",LEFT('PJ-JV'!R36,4))","v":""},{"$f":"IF('PJ-JV'!D36=0,\"\",LEFT('PJ-JV'!S36,12))","v":""},{"$f":"IF('PJ-JV'!D36=0,\"\",LEFT('PJ-JV'!T36,12))","v":""},{"$f":"IF('PJ-JV'!D36=0,\"\",LEFT('PJ-JV'!U36,20))","v":""}]
[{"$f":"IF('PJ-JV'!D37=0,\"\",\"IT\")","v":""},null,{"$f":"IF('PJ-JV'!D37=0,\"\",'PJ-JV'!B37)","v":""},null,null,null,null,null,null,null,null,{"$f":"IF('PJ-JV'!D37=0,\"\",LEFT('PJ-JV'!C37,6))","v":""},{"$f":"IF('PJ-JV'!D37=0,\"\",ROUND('PJ-JV'!D37,2))","v":""},{"$f":"IF('PJ-JV'!D37=0,\"\",LEFT('PJ-JV'!E37,6))","v":""},{"$f":"IF('PJ-JV'!D37=0,\"\",PROPER(LEFT('PJ-JV'!F37,4)))","v":""},{"$f":"IF('PJ-JV'!D37=0,\"\",LEFT('PJ-JV'!G37,9))","v":""},{"$f":"IF('PJ-JV'!D37=0,\"\",LEFT('PJ-JV'!H37,6))","v":""},{"$f":"IF('PJ-JV'!D37=0,\"\",LEFT('PJ-JV'!I37,24))","v":""},{"$f":"IF('PJ-JV'!D37=0,\"\",LEFT('PJ-JV'!J37,18))","v":""},{"$f":"IF('PJ-JV'!D37=0,\"\",LEFT('PJ-JV'!K37,50))","v":""},{"$f":"IF('PJ-JV'!D37=0,\"\",LEFT('PJ-JV'!L37,8))","v":""},{"$f":"IF('PJ-JV'!D37=0,\"\",LEFT('PJ-JV'!M37,10))","v":""},{"$f":"IF('PJ-JV'!D37=0,\"\",LEFT('PJ-JV'!N37,3))","v":""},{"$f":"IF('PJ-JV'!D37=0,\"\",LEFT('PJ-JV'!O37,6))","v":""},{"$f":"IF('PJ-JV'!D37=0,\"\",LEFT('PJ-JV'!P37,4))","v":""},{"$f":"IF('PJ-JV'!D37=0,\"\",LEFT('PJ-JV'!Q37,5))","v":""},{"$f":"IF('PJ-JV'!D37=0,\"\",LEFT('PJ-JV'!R37,4))","v":""},{"$f":"IF('PJ-JV'!D37=0,\"\",LEFT('PJ-JV'!S37,12))","v":""},{"$f":"IF('PJ-JV'!D37=0,\"\",LEFT('PJ-JV'!T37,12))","v":""},{"$f":"IF('PJ-JV'!D37=0,\"\",LEFT('PJ-JV'!U37,20))","v":""}]
[{"$f":"IF('PJ-JV'!D38=0,\"\",\"IT\")","v":""},null,{"$f":"IF('PJ-JV'!D38=0,\"\",'PJ-JV'!B38)","v":""},null,null,null,null,null,null,null,null,{"$f":"IF('PJ-JV'!D38=0,\"\",LEFT('PJ-JV'!C38,6))","v":""},{"$f":"IF('PJ-JV'!D38=0,\"\",ROUND('PJ-JV'!D38,2))","v":""},{"$f":"IF('PJ-JV'!D38=0,\"\",LEFT('PJ-JV'!E38,6))","v":""},{"$f":"IF('PJ-JV'!D38=0,\"\",PROPER(LEFT('PJ-JV'!F38,4)))","v":""},{"$f":"IF('PJ-JV'!D38=0,\"\",LEFT('PJ-JV'!G38,9))","v":""},{"$f":"IF('PJ-JV'!D38=0,\"\",LEFT('PJ-JV'!H38,6))","v":""},{"$f":"IF('PJ-JV'!D38=0,\"\",LEFT('PJ-JV'!I38,24))","v":""},{"$f":"IF('PJ-JV'!D38=0,\"\",LEFT('PJ-JV'!J38,18))","v":""},{"$f":"IF('PJ-JV'!D38=0,\"\",LEFT('PJ-JV'!K38,50))","v":""},{"$f":"IF('PJ-JV'!D38=0,\"\",LEFT('PJ-JV'!L38,8))","v":""},{"$f":"IF('PJ-JV'!D38=0,\"\",LEFT('PJ-JV'!M38,10))","v":""},{"$f":"IF('PJ-JV'!D38=0,\"\",LEFT('PJ-JV'!N38,3))","v":""},{"$f":"IF('PJ-JV'!D38=0,\"\",LEFT('PJ-JV'!O38,6))","v":""},{"$f":"IF('PJ-JV'!D38=0,\"\",LEFT('PJ-JV'!P38,4))","v":""},{"$f":"IF('PJ-JV'!D38=0,\"\",LEFT('PJ-JV'!Q38,5))","v":""},{"$f":"IF('PJ-JV'!D38=0,\"\",LEFT('PJ-JV'!R38,4))","v":""},{"$f":"IF('PJ-JV'!D38=0,\"\",LEFT('PJ-JV'!S38,12))","v":""},{"$f":"IF('PJ-JV'!D38=0,\"\",LEFT('PJ-JV'!T38,12))","v":""},{"$f":"IF('PJ-JV'!D38=0,\"\",LEFT('PJ-JV'!U38,20))","v":""}]
[{"$f":"IF('PJ-JV'!D39=0,\"\",\"IT\")","v":""},null,{"$f":"IF('PJ-JV'!D39=0,\"\",'PJ-JV'!B39)","v":""},null,null,null,null,null,null,null,null,{"$f":"IF('PJ-JV'!D39=0,\"\",LEFT('PJ-JV'!C39,6))","v":""},{"$f":"IF('PJ-JV'!D39=0,\"\",ROUND('PJ-JV'!D39,2))","v":""},{"$f":"IF('PJ-JV'!D39=0,\"\",LEFT('PJ-JV'!E39,6))","v":""},{"$f":"IF('PJ-JV'!D39=0,\"\",PROPER(LEFT('PJ-JV'!F39,4)))","v":""},{"$f":"IF('PJ-JV'!D39=0,\"\",LEFT('PJ-JV'!G39,9))","v":""},{"$f":"IF('PJ-JV'!D39=0,\"\",LEFT('PJ-JV'!H39,6))","v":""},{"$f":"IF('PJ-JV'!D39=0,\"\",LEFT('PJ-JV'!I39,24))","v":""},{"$f":"IF('PJ-JV'!D39=0,\"\",LEFT('PJ-JV'!J39,18))","v":""},{"$f":"IF('PJ-JV'!D39=0,\"\",LEFT('PJ-JV'!K39,50))","v":""},{"$f":"IF('PJ-JV'!D39=0,\"\",LEFT('PJ-JV'!L39,8))","v":""},{"$f":"IF('PJ-JV'!D39=0,\"\",LEFT('PJ-JV'!M39,10))","v":""},{"$f":"IF('PJ-JV'!D39=0,\"\",LEFT('PJ-JV'!N39,3))","v":""},{"$f":"IF('PJ-JV'!D39=0,\"\",LEFT('PJ-JV'!O39,6))","v":""},{"$f":"IF('PJ-JV'!D39=0,\"\",LEFT('PJ-JV'!P39,4))","v":""},{"$f":"IF('PJ-JV'!D39=0,\"\",LEFT('PJ-JV'!Q39,5))","v":""},{"$f":"IF('PJ-JV'!D39=0,\"\",LEFT('PJ-JV'!R39,4))","v":""},{"$f":"IF('PJ-JV'!D39=0,\"\",LEFT('PJ-JV'!S39,12))","v":""},{"$f":"IF('PJ-JV'!D39=0,\"\",LEFT('PJ-JV'!T39,12))","v":""},{"$f":"IF('PJ-JV'!D39=0,\"\",LEFT('PJ-JV'!U39,20))","v":""}]
[{"$f":"IF('PJ-JV'!D40=0,\"\",\"IT\")","v":""},null,{"$f":"IF('PJ-JV'!D40=0,\"\",'PJ-JV'!B40)","v":""},null,null,null,null,null,null,null,null,{"$f":"IF('PJ-JV'!D40=0,\"\",LEFT('PJ-JV'!C40,6))","v":""},{"$f":"IF('PJ-JV'!D40=0,\"\",ROUND('PJ-JV'!D40,2))","v":""},{"$f":"IF('PJ-JV'!D40=0,\"\",LEFT('PJ-JV'!E40,6))","v":""},{"$f":"IF('PJ-JV'!D40=0,\"\",PROPER(LEFT('PJ-JV'!F40,4)))","v":""},{"$f":"IF('PJ-JV'!D40=0,\"\",LEFT('PJ-JV'!G40,9))","v":""},{"$f":"IF('PJ-JV'!D40=0,\"\",LEFT('PJ-JV'!H40,6))","v":""},{"$f":"IF('PJ-JV'!D40=0,\"\",LEFT('PJ-JV'!I40,24))","v":""},{"$f":"IF('PJ-JV'!D40=0,\"\",LEFT('PJ-JV'!J40,18))","v":""},{"$f":"IF('PJ-JV'!D40=0,\"\",LEFT('PJ-JV'!K40,50))","v":""},{"$f":"IF('PJ-JV'!D40=0,\"\",LEFT('PJ-JV'!L40,8))","v":""},{"$f":"IF('PJ-JV'!D40=0,\"\",LEFT('PJ-JV'!M40,10))","v":""},{"$f":"IF('PJ-JV'!D40=0,\"\",LEFT('PJ-JV'!N40,3))","v":""},{"$f":"IF('PJ-JV'!D40=0,\"\",LEFT('PJ-JV'!O40,6))","v":""},{"$f":"IF('PJ-JV'!D40=0,\"\",LEFT('PJ-JV'!P40,4))","v":""},{"$f":"IF('PJ-JV'!D40=0,\"\",LEFT('PJ-JV'!Q40,5))","v":""},{"$f":"IF('PJ-JV'!D40=0,\"\",LEFT('PJ-JV'!R40,4))","v":""},{"$f":"IF('PJ-JV'!D40=0,\"\",LEFT('PJ-JV'!S40,12))","v":""},{"$f":"IF('PJ-JV'!D40=0,\"\",LEFT('PJ-JV'!T40,12))","v":""},{"$f":"IF('PJ-JV'!D40=0,\"\",LEFT('PJ-JV'!U40,20))","v":""}]
[{"$f":"IF('PJ-JV'!D41=0,\"\",\"IT\")","v":""},null,{"$f":"IF('PJ-JV'!D41=0,\"\",'PJ-JV'!B41)","v":""},null,null,null,null,null,null,null,null,{"$f":"IF('PJ-JV'!D41=0,\"\",LEFT('PJ-JV'!C41,6))","v":""},{"$f":"IF('PJ-JV'!D41=0,\"\",ROUND('PJ-JV'!D41,2))","v":""},{"$f":"IF('PJ-JV'!D41=0,\"\",LEFT('PJ-JV'!E41,6))","v":""},{"$f":"IF('PJ-JV'!D41=0,\"\",PROPER(LEFT('PJ-JV'!F41,4)))","v":""},{"$f":"IF('PJ-JV'!D41=0,\"\",LEFT('PJ-JV'!G41,9))","v":""},{"$f":"IF('PJ-JV'!D41=0,\"\",LEFT('PJ-JV'!H41,6))","v":""},{"$f":"IF('PJ-JV'!D41=0,\"\",LEFT('PJ-JV'!I41,24))","v":""},{"$f":"IF('PJ-JV'!D41=0,\"\",LEFT('PJ-JV'!J41,18))","v":""},{"$f":"IF('PJ-JV'!D41=0,\"\",LEFT('PJ-JV'!K41,50))","v":""},{"$f":"IF('PJ-JV'!D41=0,\"\",LEFT('PJ-JV'!L41,8))","v":""},{"$f":"IF('PJ-JV'!D41=0,\"\",LEFT('PJ-JV'!M41,10))","v":""},{"$f":"IF('PJ-JV'!D41=0,\"\",LEFT('PJ-JV'!N41,3))","v":""},{"$f":"IF('PJ-JV'!D41=0,\"\",LEFT('PJ-JV'!O41,6))","v":""},{"$f":"IF('PJ-JV'!D41=0,\"\",LEFT('PJ-JV'!P41,4))","v":""},{"$f":"IF('PJ-JV'!D41=0,\"\",LEFT('PJ-JV'!Q41,5))","v":""},{"$f":"IF('PJ-JV'!D41=0,\"\",LEFT('PJ-JV'!R41,4))","v":""},{"$f":"IF('PJ-JV'!D41=0,\"\",LEFT('PJ-JV'!S41,12))","v":""},{"$f":"IF('PJ-JV'!D41=0,\"\",LEFT('PJ-JV'!T41,12))","v":""},{"$f":"IF('PJ-JV'!D41=0,\"\",LEFT('PJ-JV'!U41,20))","v":""}]
[{"$f":"IF('PJ-JV'!D42=0,\"\",\"IT\")","v":""},null,{"$f":"IF('PJ-JV'!D42=0,\"\",'PJ-JV'!B42)","v":""},null,null,null,null,null,null,null,null,{"$f":"IF('PJ-JV'!D42=0,\"\",LEFT('PJ-JV'!C42,6))","v":""},{"$f":"IF('PJ-JV'!D42=0,\"\",ROUND('PJ-JV'!D42,2))","v":""},{"$f":"IF('PJ-JV'!D42=0,\"\",LEFT('PJ-JV'!E42,6))","v":""},{"$f":"IF('PJ-JV'!D42=0,\"\",PROPER(LEFT('PJ-JV'!F42,4)))","v":""},{"$f":"IF('PJ-JV'!D42=0,\"\",LEFT('PJ-JV'!G42,9))","v":""},{"$f":"IF('PJ-JV'!D42=0,\"\",LEFT('PJ-JV'!H42,6))","v":""},{"$f":"IF('PJ-JV'!D42=0,\"\",LEFT('PJ-JV'!I42,24))","v":""},{"$f":"IF('PJ-JV'!D42=0,\"\",LEFT('PJ-JV'!J42,18))","v":""},{"$f":"IF('PJ-JV'!D42=0,\"\",LEFT('PJ-JV'!K42,50))","v":""},{"$f":"IF('PJ-JV'!D42=0,\"\",LEFT('PJ-JV'!L42,8))","v":""},{"$f":"IF('PJ-JV'!D42=0,\"\",LEFT('PJ-JV'!M42,10))","v":""},{"$f":"IF('PJ-JV'!D42=0,\"\",LEFT('PJ-JV'!N42,3))","v":""},{"$f":"IF('PJ-JV'!D42=0,\"\",LEFT('PJ-JV'!O42,6))","v":""},{"$f":"IF('PJ-JV'!D42=0,\"\",LEFT('PJ-JV'!P42,4))","v":""},{"$f":"IF('PJ-JV'!D42=0,\"\",LEFT('PJ-JV'!Q42,5))","v":""},{"$f":"IF('PJ-JV'!D42=0,\"\",LEFT('PJ-JV'!R42,4))","v":""},{"$f":"IF('PJ-JV'!D42=0,\"\",LEFT('PJ-JV'!S42,12))","v":""},{"$f":"IF('PJ-JV'!D42=0,\"\",LEFT('PJ-JV'!T42,12))","v":""},{"$f":"IF('PJ-JV'!D42=0,\"\",LEFT('PJ-JV'!U42,20))","v":""}]
[{"$f":"IF('PJ-JV'!D43=0,\"\",\"IT\")","v":""},null,{"$f":"IF('PJ-JV'!D43=0,\"\",'PJ-JV'!B43)","v":""},null,null,null,null,null,null,null,null,{"$f":"IF('PJ-JV'!D43=0,\"\",LEFT('PJ-JV'!C43,6))","v":""},{"$f":"IF('PJ-JV'!D43=0,\"\",ROUND('PJ-JV'!D43,2))","v":""},{"$f":"IF('PJ-JV'!D43=0,\"\",LEFT('PJ-JV'!E43,6))","v":""},{"$f":"IF('PJ-JV'!D43=0,\"\",PROPER(LEFT('PJ-JV'!F43,4)))","v":""},{"$f":"IF('PJ-JV'!D43=0,\"\",LEFT('PJ-JV'!G43,9))","v":""},{"$f":"IF('PJ-JV'!D43=0,\"\",LEFT('PJ-JV'!H43,6))","v":""},{"$f":"IF('PJ-JV'!D43=0,\"\",LEFT('PJ-JV'!I43,24))","v":""},{"$f":"IF('PJ-JV'!D43=0,\"\",LEFT('PJ-JV'!J43,18))","v":""},{"$f":"IF('PJ-JV'!D43=0,\"\",LEFT('PJ-JV'!K43,50))","v":""},{"$f":"IF('PJ-JV'!D43=0,\"\",LEFT('PJ-JV'!L43,8))","v":""},{"$f":"IF('PJ-JV'!D43=0,\"\",LEFT('PJ-JV'!M43,10))","v":""},{"$f":"IF('PJ-JV'!D43=0,\"\",LEFT('PJ-JV'!N43,3))","v":""},{"$f":"IF('PJ-JV'!D43=0,\"\",LEFT('PJ-JV'!O43,6))","v":""},{"$f":"IF('PJ-JV'!D43=0,\"\",LEFT('PJ-JV'!P43,4))","v":""},{"$f":"IF('PJ-JV'!D43=0,\"\",LEFT('PJ-JV'!Q43,5))","v":""},{"$f":"IF('PJ-JV'!D43=0,\"\",LEFT('PJ-JV'!R43,4))","v":""},{"$f":"IF('PJ-JV'!D43=0,\"\",LEFT('PJ-JV'!S43,12))","v":""},{"$f":"IF('PJ-JV'!D43=0,\"\",LEFT('PJ-JV'!T43,12))","v":""},{"$f":"IF('PJ-JV'!D43=0,\"\",LEFT('PJ-JV'!U43,20))","v":""}]
[{"$f":"IF('PJ-JV'!D44=0,\"\",\"IT\")","v":""},null,{"$f":"IF('PJ-JV'!D44=0,\"\",'PJ-JV'!B44)","v":""},null,null,null,null,null,null,null,null,{"$f":"IF('PJ-JV'!D44=0,\"\",LEFT('PJ-JV'!C44,6))","v":""},{"$f":"IF('PJ-JV'!D44=0,\"\",ROUND('PJ-JV'!D44,2))","v":""},{"$f":"IF('PJ-JV'!D44=0,\"\",LEFT('PJ-JV'!E44,6))","v":""},{"$f":"IF('PJ-JV'!D44=0,\"\",PROPER(LEFT('PJ-JV'!F44,4)))","v":""},{"$f":"IF('PJ-JV'!D44=0,\"\",LEFT('PJ-JV'!G44,9))","v":""},{"$f":"IF('PJ-JV'!D44=0,\"\",LEFT('PJ-JV'!H44,6))","v":""},{"$f":"IF('PJ-JV'!D44=0,\"\",LEFT('PJ-JV'!I44,24))","v":""},{"$f":"IF('PJ-JV'!D44=0,\"\",LEFT('PJ-JV'!J44,18))","v":""},{"$f":"IF('PJ-JV'!D44=0,\"\",LEFT('PJ-JV'!K44,50))","v":""},{"$f":"IF('PJ-JV'!D44=0,\"\",LEFT('PJ-JV'!L44,8))","v":""},{"$f":"IF('PJ-JV'!D44=0,\"\",LEFT('PJ-JV'!M44,10))","v":""},{"$f":"IF('PJ-JV'!D44=0,\"\",LEFT('PJ-JV'!N44,3))","v":""},{"$f":"IF('PJ-JV'!D44=0,\"\",LEFT('PJ-JV'!O44,6))","v":""},{"$f":"IF('PJ-JV'!D44=0,\"\",LEFT('PJ-JV'!P44,4))","v":""},{"$f":"IF('PJ-JV'!D44=0,\"\",LEFT('PJ-JV'!Q44,5))","v":""},{"$f":"IF('PJ-JV'!D44=0,\"\",LEFT('PJ-JV'!R44,4))","v":""},{"$f":"IF('PJ-JV'!D44=0,\"\",LEFT('PJ-JV'!S44,12))","v":""},{"$f":"IF('PJ-JV'!D44=0,\"\",LEFT('PJ-JV'!T44,12))","v":""},{"$f":"IF('PJ-JV'!D44=0,\"\",LEFT('PJ-JV'!U44,20))","v":""}]
[{"$f":"IF('PJ-JV'!D45=0,\"\",\"IT\")","v":""},null,{"$f":"IF('PJ-JV'!D45=0,\"\",'PJ-JV'!B45)","v":""},null,null,null,null,null,null,null,null,{"$f":"IF('PJ-JV'!D45=0,\"\",LEFT('PJ-JV'!C45,6))","v":""},{"$f":"IF('PJ-JV'!D45=0,\"\",ROUND('PJ-JV'!D45,2))","v":""},{"$f":"IF('PJ-JV'!D45=0,\"\",LEFT('PJ-JV'!E45,6))","v":""},{"$f":"IF('PJ-JV'!D45=0,\"\",PROPER(LEFT('PJ-JV'!F45,4)))","v":""},{"$f":"IF('PJ-JV'!D45=0,\"\",LEFT('PJ-JV'!G45,9))","v":""},{"$f":"IF('PJ-JV'!D45=0,\"\",LEFT('PJ-JV'!H45,6))","v":""},{"$f":"IF('PJ-JV'!D45=0,\"\",LEFT('PJ-JV'!I45,24))","v":""},{"$f":"IF('PJ-JV'!D45=0,\"\",LEFT('PJ-JV'!J45,18))","v":""},{"$f":"IF('PJ-JV'!D45=0,\"\",LEFT('PJ-JV'!K45,50))","v":""},{"$f":"IF('PJ-JV'!D45=0,\"\",LEFT('PJ-JV'!L45,8))","v":""},{"$f":"IF('PJ-JV'!D45=0,\"\",LEFT('PJ-JV'!M45,10))","v":""},{"$f":"IF('PJ-JV'!D45=0,\"\",LEFT('PJ-JV'!N45,3))","v":""},{"$f":"IF('PJ-JV'!D45=0,\"\",LEFT('PJ-JV'!O45,6))","v":""},{"$f":"IF('PJ-JV'!D45=0,\"\",LEFT('PJ-JV'!P45,4))","v":""},{"$f":"IF('PJ-JV'!D45=0,\"\",LEFT('PJ-JV'!Q45,5))","v":""},{"$f":"IF('PJ-JV'!D45=0,\"\",LEFT('PJ-JV'!R45,4))","v":""},{"$f":"IF('PJ-JV'!D45=0,\"\",LEFT('PJ-JV'!S45,12))","v":""},{"$f":"IF('PJ-JV'!D45=0,\"\",LEFT('PJ-JV'!T45,12))","v":""},{"$f":"IF('PJ-JV'!D45=0,\"\",LEFT('PJ-JV'!U45,20))","v":""}]
[{"$f":"IF('PJ-JV'!D46=0,\"\",\"IT\")","v":""},null,{"$f":"IF('PJ-JV'!D46=0,\"\",'PJ-JV'!B46)","v":""},null,null,null,null,null,null,null,null,{"$f":"IF('PJ-JV'!D46=0,\"\",LEFT('PJ-JV'!C46,6))","v":""},{"$f":"IF('PJ-JV'!D46=0,\"\",ROUND('PJ-JV'!D46,2))","v":""},{"$f":"IF('PJ-JV'!D46=0,\"\",LEFT('PJ-JV'!E46,6))","v":""},{"$f":"IF('PJ-JV'!D46=0,\"\",PROPER(LEFT('PJ-JV'!F46,4)))","v":""},{"$f":"IF('PJ-JV'!D46=0,\"\",LEFT('PJ-JV'!G46,9))","v":""},{"$f":"IF('PJ-JV'!D46=0,\"\",LEFT('PJ-JV'!H46,6))","v":""},{"$f":"IF('PJ-JV'!D46=0,\"\",LEFT('PJ-JV'!I46,24))","v":""},{"$f":"IF('PJ-JV'!D46=0,\"\",LEFT('PJ-JV'!J46,18))","v":""},{"$f":"IF('PJ-JV'!D46=0,\"\",LEFT('PJ-JV'!K46,50))","v":""},{"$f":"IF('PJ-JV'!D46=0,\"\",LEFT('PJ-JV'!L46,8))","v":""},{"$f":"IF('PJ-JV'!D46=0,\"\",LEFT('PJ-JV'!M46,10))","v":""},{"$f":"IF('PJ-JV'!D46=0,\"\",LEFT('PJ-JV'!N46,3))","v":""},{"$f":"IF('PJ-JV'!D46=0,\"\",LEFT('PJ-JV'!O46,6))","v":""},{"$f":"IF('PJ-JV'!D46=0,\"\",LEFT('PJ-JV'!P46,4))","v":""},{"$f":"IF('PJ-JV'!D46=0,\"\",LEFT('PJ-JV'!Q46,5))","v":""},{"$f":"IF('PJ-JV'!D46=0,\"\",LEFT('PJ-JV'!R46,4))","v":""},{"$f":"IF('PJ-JV'!D46=0,\"\",LEFT('PJ-JV'!S46,12))","v":""},{"$f":"IF('PJ-JV'!D46=0,\"\",LEFT('PJ-JV'!T46,12))","v":""},{"$f":"IF('PJ-JV'!D46=0,\"\",LEFT('PJ-JV'!U46,20))","v":""}]
[{"$f":"IF('PJ-JV'!D47=0,\"\",\"IT\")","v":""},null,{"$f":"IF('PJ-JV'!D47=0,\"\",'PJ-JV'!B47)","v":""},null,null,null,null,null,null,null,null,{"$f":"IF('PJ-JV'!D47=0,\"\",LEFT('PJ-JV'!C47,6))","v":""},{"$f":"IF('PJ-JV'!D47=0,\"\",ROUND('PJ-JV'!D47,2))","v":""},{"$f":"IF('PJ-JV'!D47=0,\"\",LEFT('PJ-JV'!E47,6))","v":""},{"$f":"IF('PJ-JV'!D47=0,\"\",PROPER(LEFT('PJ-JV'!F47,4)))","v":""},{"$f":"IF('PJ-JV'!D47=0,\"\",LEFT('PJ-JV'!G47,9))","v":""},{"$f":"IF('PJ-JV'!D47=0,\"\",LEFT('PJ-JV'!H47,6))","v":""},{"$f":"IF('PJ-JV'!D47=0,\"\",LEFT('PJ-JV'!I47,24))","v":""},{"$f":"IF('PJ-JV'!D47=0,\"\",LEFT('PJ-JV'!J47,18))","v":""},{"$f":"IF('PJ-JV'!D47=0,\"\",LEFT('PJ-JV'!K47,50))","v":""},{"$f":"IF('PJ-JV'!D47=0,\"\",LEFT('PJ-JV'!L47,8))","v":""},{"$f":"IF('PJ-JV'!D47=0,\"\",LEFT('PJ-JV'!M47,10))","v":""},{"$f":"IF('PJ-JV'!D47=0,\"\",LEFT('PJ-JV'!N47,3))","v":""},{"$f":"IF('PJ-JV'!D47=0,\"\",LEFT('PJ-JV'!O47,6))","v":""},{"$f":"IF('PJ-JV'!D47=0,\"\",LEFT('PJ-JV'!P47,4))","v":""},{"$f":"IF('PJ-JV'!D47=0,\"\",LEFT('PJ-JV'!Q47,5))","v":""},{"$f":"IF('PJ-JV'!D47=0,\"\",LEFT('PJ-JV'!R47,4))","v":""},{"$f":"IF('PJ-JV'!D47=0,\"\",LEFT('PJ-JV'!S47,12))","v":""},{"$f":"IF('PJ-JV'!D47=0,\"\",LEFT('PJ-JV'!T47,12))","v":""},{"$f":"IF('PJ-JV'!D47=0,\"\",LEFT('PJ-JV'!U47,20))","v":""}]
[{"$f":"IF('PJ-JV'!D48=0,\"\",\"IT\")","v":""},null,{"$f":"IF('PJ-JV'!D48=0,\"\",'PJ-JV'!B48)","v":""},null,null,null,null,null,null,null,null,{"$f":"IF('PJ-JV'!D48=0,\"\",LEFT('PJ-JV'!C48,6))","v":""},{"$f":"IF('PJ-JV'!D48=0,\"\",ROUND('PJ-JV'!D48,2))","v":""},{"$f":"IF('PJ-JV'!D48=0,\"\",LEFT('PJ-JV'!E48,6))","v":""},{"$f":"IF('PJ-JV'!D48=0,\"\",PROPER(LEFT('PJ-JV'!F48,4)))","v":""},{"$f":"IF('PJ-JV'!D48=0,\"\",LEFT('PJ-JV'!G48,9))","v":""},{"$f":"IF('PJ-JV'!D48=0,\"\",LEFT('PJ-JV'!H48,6))","v":""},{"$f":"IF('PJ-JV'!D48=0,\"\",LEFT('PJ-JV'!I48,24))","v":""},{"$f":"IF('PJ-JV'!D48=0,\"\",LEFT('PJ-JV'!J48,18))","v":""},{"$f":"IF('PJ-JV'!D48=0,\"\",LEFT('PJ-JV'!K48,50))","v":""},{"$f":"IF('PJ-JV'!D48=0,\"\",LEFT('PJ-JV'!L48,8))","v":""},{"$f":"IF('PJ-JV'!D48=0,\"\",LEFT('PJ-JV'!M48,10))","v":""},{"$f":"IF('PJ-JV'!D48=0,\"\",LEFT('PJ-JV'!N48,3))","v":""},{"$f":"IF('PJ-JV'!D48=0,\"\",LEFT('PJ-JV'!O48,6))","v":""},{"$f":"IF('PJ-JV'!D48=0,\"\",LEFT('PJ-JV'!P48,4))","v":""},{"$f":"IF('PJ-JV'!D48=0,\"\",LEFT('PJ-JV'!Q48,5))","v":""},{"$f":"IF('PJ-JV'!D48=0,\"\",LEFT('PJ-JV'!R48,4))","v":""},{"$f":"IF('PJ-JV'!D48=0,\"\",LEFT('PJ-JV'!S48,12))","v":""},{"$f":"IF('PJ-JV'!D48=0,\"\",LEFT('PJ-JV'!T48,12))","v":""},{"$f":"IF('PJ-JV'!D48=0,\"\",LEFT('PJ-JV'!U48,20))","v":""}]
[{"$f":"IF('PJ-JV'!D49=0,\"\",\"IT\")","v":""},null,{"$f":"IF('PJ-JV'!D49=0,\"\",'PJ-JV'!B49)","v":""},null,null,null,null,null,null,null,null,{"$f":"IF('PJ-JV'!D49=0,\"\",LEFT('PJ-JV'!C49,6))","v":""},{"$f":"IF('PJ-JV'!D49=0,\"\",ROUND('PJ-JV'!D49,2))","v":""},{"$f":"IF('PJ-JV'!D49=0,\"\",LEFT('PJ-JV'!E49,6))","v":""},{"$f":"IF('PJ-JV'!D49=0,\"\",PROPER(LEFT('PJ-JV'!F49,4)))","v":""},{"$f":"IF('PJ-JV'!D49=0,\"\",LEFT('PJ-JV'!G49,9))","v":""},{"$f":"IF('PJ-JV'!D49=0,\"\",LEFT('PJ-JV'!H49,6))","v":""},{"$f":"IF('PJ-JV'!D49=0,\"\",LEFT('PJ-JV'!I49,24))","v":""},{"$f":"IF('PJ-JV'!D49=0,\"\",LEFT('PJ-JV'!J49,18))","v":""},{"$f":"IF('PJ-JV'!D49=0,\"\",LEFT('PJ-JV'!K49,50))","v":""},{"$f":"IF('PJ-JV'!D49=0,\"\",LEFT('PJ-JV'!L49,8))","v":""},{"$f":"IF('PJ-JV'!D49=0,\"\",LEFT('PJ-JV'!M49,10))","v":""},{"$f":"IF('PJ-JV'!D49=0,\"\",LEFT('PJ-JV'!N49,3))","v":""},{"$f":"IF('PJ-JV'!D49=0,\"\",LEFT('PJ-JV'!O49,6))","v":""},{"$f":"IF('PJ-JV'!D49=0,\"\",LEFT('PJ-JV'!P49,4))","v":""},{"$f":"IF('PJ-JV'!D49=0,\"\",LEFT('PJ-JV'!Q49,5))","v":""},{"$f":"IF('PJ-JV'!D49=0,\"\",LEFT('PJ-JV'!R49,4))","v":""},{"$f":"IF('PJ-JV'!D49=0,\"\",LEFT('PJ-JV'!S49,12))","v":""},{"$f":"IF('PJ-JV'!D49=0,\"\",LEFT('PJ-JV'!T49,12))","v":""},{"$f":"IF('PJ-JV'!D49=0,\"\",LEFT('PJ-JV'!U49,20))","v":""}]
[{"$f":"IF('PJ-JV'!D50=0,\"\",\"IT\")","v":""},null,{"$f":"IF('PJ-JV'!D50=0,\"\",'PJ-JV'!B50)","v":""},null,null,null,null,null,null,null,null,{"$f":"IF('PJ-JV'!D50=0,\"\",LEFT('PJ-JV'!C50,6))","v":""},{"$f":"IF('PJ-JV'!D50=0,\"\",ROUND('PJ-JV'!D50,2))","v":""},{"$f":"IF('PJ-JV'!D50=0,\"\",LEFT('PJ-JV'!E50,6))","v":""},{"$f":"IF('PJ-JV'!D50=0,\"\",PROPER(LEFT('PJ-JV'!F50,4)))","v":""},{"$f":"IF('PJ-JV'!D50=0,\"\",LEFT('PJ-JV'!G50,9))","v":""},{"$f":"IF('PJ-JV'!D50=0,\"\",LEFT('PJ-JV'!H50,6))","v":""},{"$f":"IF('PJ-JV'!D50=0,\"\",LEFT('PJ-JV'!I50,24))","v":""},{"$f":"IF('PJ-JV'!D50=0,\"\",LEFT('PJ-JV'!J50,18))","v":""},{"$f":"IF('PJ-JV'!D50=0,\"\",LEFT('PJ-JV'!K50,50))","v":""},{"$f":"IF('PJ-JV'!D50=0,\"\",LEFT('PJ-JV'!L50,8))","v":""},{"$f":"IF('PJ-JV'!D50=0,\"\",LEFT('PJ-JV'!M50,10))","v":""},{"$f":"IF('PJ-JV'!D50=0,\"\",LEFT('PJ-JV'!N50,3))","v":""},{"$f":"IF('PJ-JV'!D50=0,\"\",LEFT('PJ-JV'!O50,6))","v":""},{"$f":"IF('PJ-JV'!D50=0,\"\",LEFT('PJ-JV'!P50,4))","v":""},{"$f":"IF('PJ-JV'!D50=0,\"\",LEFT('PJ-JV'!Q50,5))","v":""},{"$f":"IF('PJ-JV'!D50=0,\"\",LEFT('PJ-JV'!R50,4))","v":""},{"$f":"IF('PJ-JV'!D50=0,\"\",LEFT('PJ-JV'!S50,12))","v":""},{"$f":"IF('PJ-JV'!D50=0,\"\",LEFT('PJ-JV'!T50,12))","v":""},{"$f":"IF('PJ-JV'!D50=0,\"\",LEFT('PJ-JV'!U50,20))","v":""}]
[{"$f":"IF('PJ-JV'!D51=0,\"\",\"IT\")","v":""},null,{"$f":"IF('PJ-JV'!D51=0,\"\",'PJ-JV'!B51)","v":""},null,null,null,null,null,null,null,null,{"$f":"IF('PJ-JV'!D51=0,\"\",LEFT('PJ-JV'!C51,6))","v":""},{"$f":"IF('PJ-JV'!D51=0,\"\",ROUND('PJ-JV'!D51,2))","v":""},{"$f":"IF('PJ-JV'!D51=0,\"\",LEFT('PJ-JV'!E51,6))","v":""},{"$f":"IF('PJ-JV'!D51=0,\"\",PROPER(LEFT('PJ-JV'!F51,4)))","v":""},{"$f":"IF('PJ-JV'!D51=0,\"\",LEFT('PJ-JV'!G51,9))","v":""},{"$f":"IF('PJ-JV'!D51=0,\"\",LEFT('PJ-JV'!H51,6))","v":""},{"$f":"IF('PJ-JV'!D51=0,\"\",LEFT('PJ-JV'!I51,24))","v":""},{"$f":"IF('PJ-JV'!D51=0,\"\",LEFT('PJ-JV'!J51,18))","v":""},{"$f":"IF('PJ-JV'!D51=0,\"\",LEFT('PJ-JV'!K51,50))","v":""},{"$f":"IF('PJ-JV'!D51=0,\"\",LEFT('PJ-JV'!L51,8))","v":""},{"$f":"IF('PJ-JV'!D51=0,\"\",LEFT('PJ-JV'!M51,10))","v":""},{"$f":"IF('PJ-JV'!D51=0,\"\",LEFT('PJ-JV'!N51,3))","v":""},{"$f":"IF('PJ-JV'!D51=0,\"\",LEFT('PJ-JV'!O51,6))","v":""},{"$f":"IF('PJ-JV'!D51=0,\"\",LEFT('PJ-JV'!P51,4))","v":""},{"$f":"IF('PJ-JV'!D51=0,\"\",LEFT('PJ-JV'!Q51,5))","v":""},{"$f":"IF('PJ-JV'!D51=0,\"\",LEFT('PJ-JV'!R51,4))","v":""},{"$f":"IF('PJ-JV'!D51=0,\"\",LEFT('PJ-JV'!S51,12))","v":""},{"$f":"IF('PJ-JV'!D51=0,\"\",LEFT('PJ-JV'!T51,12))","v":""},{"$f":"IF('PJ-JV'!D51=0,\"\",LEFT('PJ-JV'!U51,20))","v":""}]
[{"$f":"IF('PJ-JV'!D52=0,\"\",\"IT\")","v":""},null,{"$f":"IF('PJ-JV'!D52=0,\"\",'PJ-JV'!B52)","v":""},null,null,null,null,null,null,null,null,{"$f":"IF('PJ-JV'!D52=0,\"\",LEFT('PJ-JV'!C52,6))","v":""},{"$f":"IF('PJ-JV'!D52=0,\"\",ROUND('PJ-JV'!D52,2))","v":""},{"$f":"IF('PJ-JV'!D52=0,\"\",LEFT('PJ-JV'!E52,6))","v":""},{"$f":"IF('PJ-JV'!D52=0,\"\",PROPER(LEFT('PJ-JV'!F52,4)))","v":""},{"$f":"IF('PJ-JV'!D52=0,\"\",LEFT('PJ-JV'!G52,9))","v":""},{"$f":"IF('PJ-JV'!D52=0,\"\",LEFT('PJ-JV'!H52,6))","v":""},{"$f":"IF('PJ-JV'!D52=0,\"\",LEFT('PJ-JV'!I52,24))","v":""},{"$f":"IF('PJ-JV'!D52=0,\"\",LEFT('PJ-JV'!J52,18))","v":""},{"$f":"IF('PJ-JV'!D52=0,\"\",LEFT('PJ-JV'!K52,50))","v":""},{"$f":"IF('PJ-JV'!D52=0,\"\",LEFT('PJ-JV'!L52,8))","v":""},{"$f":"IF('PJ-JV'!D52=0,\"\",LEFT('PJ-JV'!M52,10))","v":""},{"$f":"IF('PJ-JV'!D52=0,\"\",LEFT('PJ-JV'!N52,3))","v":""},{"$f":"IF('PJ-JV'!D52=0,\"\",LEFT('PJ-JV'!O52,6))","v":""},{"$f":"IF('PJ-JV'!D52=0,\"\",LEFT('PJ-JV'!P52,4))","v":""},{"$f":"IF('PJ-JV'!D52=0,\"\",LEFT('PJ-JV'!Q52,5))","v":""},{"$f":"IF('PJ-JV'!D52=0,\"\",LEFT('PJ-JV'!R52,4))","v":""},{"$f":"IF('PJ-JV'!D52=0,\"\",LEFT('PJ-JV'!S52,12))","v":""},{"$f":"IF('PJ-JV'!D52=0,\"\",LEFT('PJ-JV'!T52,12))","v":""},{"$f":"IF('PJ-JV'!D52=0,\"\",LEFT('PJ-JV'!U52,20))","v":""}]
[{"$f":"IF('PJ-JV'!D53=0,\"\",\"IT\")","v":""},null,{"$f":"IF('PJ-JV'!D53=0,\"\",'PJ-JV'!B53)","v":""},null,null,null,null,null,null,null,null,{"$f":"IF('PJ-JV'!D53=0,\"\",LEFT('PJ-JV'!C53,6))","v":""},{"$f":"IF('PJ-JV'!D53=0,\"\",ROUND('PJ-JV'!D53,2))","v":""},{"$f":"IF('PJ-JV'!D53=0,\"\",LEFT('PJ-JV'!E53,6))","v":""},{"$f":"IF('PJ-JV'!D53=0,\"\",PROPER(LEFT('PJ-JV'!F53,4)))","v":""},{"$f":"IF('PJ-JV'!D53=0,\"\",LEFT('PJ-JV'!G53,9))","v":""},{"$f":"IF('PJ-JV'!D53=0,\"\",LEFT('PJ-JV'!H53,6))","v":""},{"$f":"IF('PJ-JV'!D53=0,\"\",LEFT('PJ-JV'!I53,24))","v":""},{"$f":"IF('PJ-JV'!D53=0,\"\",LEFT('PJ-JV'!J53,18))","v":""},{"$f":"IF('PJ-JV'!D53=0,\"\",LEFT('PJ-JV'!K53,50))","v":""},{"$f":"IF('PJ-JV'!D53=0,\"\",LEFT('PJ-JV'!L53,8))","v":""},{"$f":"IF('PJ-JV'!D53=0,\"\",LEFT('PJ-JV'!M53,10))","v":""},{"$f":"IF('PJ-JV'!D53=0,\"\",LEFT('PJ-JV'!N53,3))","v":""},{"$f":"IF('PJ-JV'!D53=0,\"\",LEFT('PJ-JV'!O53,6))","v":""},{"$f":"IF('PJ-JV'!D53=0,\"\",LEFT('PJ-JV'!P53,4))","v":""},{"$f":"IF('PJ-JV'!D53=0,\"\",LEFT('PJ-JV'!Q53,5))","v":""},{"$f":"IF('PJ-JV'!D53=0,\"\",LEFT('PJ-JV'!R53,4))","v":""},{"$f":"IF('PJ-JV'!D53=0,\"\",LEFT('PJ-JV'!S53,12))","v":""},{"$f":"IF('PJ-JV'!D53=0,\"\",LEFT('PJ-JV'!T53,12))","v":""},{"$f":"IF('PJ-JV'!D53=0,\"\",LEFT('PJ-JV'!U53,20))","v":""}]
[{"$f":"IF('PJ-JV'!D54=0,\"\",\"IT\")","v":""},null,{"$f":"IF('PJ-JV'!D54=0,\"\",'PJ-JV'!B54)","v":""},null,null,null,null,null,null,null,null,{"$f":"IF('PJ-JV'!D54=0,\"\",LEFT('PJ-JV'!C54,6))","v":""},{"$f":"IF('PJ-JV'!D54=0,\"\",ROUND('PJ-JV'!D54,2))","v":""},{"$f":"IF('PJ-JV'!D54=0,\"\",LEFT('PJ-JV'!E54,6))","v":""},{"$f":"IF('PJ-JV'!D54=0,\"\",PROPER(LEFT('PJ-JV'!F54,4)))","v":""},{"$f":"IF('PJ-JV'!D54=0,\"\",LEFT('PJ-JV'!G54,9))","v":""},{"$f":"IF('PJ-JV'!D54=0,\"\",LEFT('PJ-JV'!H54,6))","v":""},{"$f":"IF('PJ-JV'!D54=0,\"\",LEFT('PJ-JV'!I54,24))","v":""},{"$f":"IF('PJ-JV'!D54=0,\"\",LEFT('PJ-JV'!J54,18))","v":""},{"$f":"IF('PJ-JV'!D54=0,\"\",LEFT('PJ-JV'!K54,50))","v":""},{"$f":"IF('PJ-JV'!D54=0,\"\",LEFT('PJ-JV'!L54,8))","v":""},{"$f":"IF('PJ-JV'!D54=0,\"\",LEFT('PJ-JV'!M54,10))","v":""},{"$f":"IF('PJ-JV'!D54=0,\"\",LEFT('PJ-JV'!N54,3))","v":""},{"$f":"IF('PJ-JV'!D54=0,\"\",LEFT('PJ-JV'!O54,6))","v":""},{"$f":"IF('PJ-JV'!D54=0,\"\",LEFT('PJ-JV'!P54,4))","v":""},{"$f":"IF('PJ-JV'!D54=0,\"\",LEFT('PJ-JV'!Q54,5))","v":""},{"$f":"IF('PJ-JV'!D54=0,\"\",LEFT('PJ-JV'!R54,4))","v":""},{"$f":"IF('PJ-JV'!D54=0,\"\",LEFT('PJ-JV'!S54,12))","v":""},{"$f":"IF('PJ-JV'!D54=0,\"\",LEFT('PJ-JV'!T54,12))","v":""},{"$f":"IF('PJ-JV'!D54=0,\"\",LEFT('PJ-JV'!U54,20))","v":""}]
[{"$f":"IF('PJ-JV'!D55=0,\"\",\"IT\")","v":""},null,{"$f":"IF('PJ-JV'!D55=0,\"\",'PJ-JV'!B55)","v":""},null,null,null,null,null,null,null,null,{"$f":"IF('PJ-JV'!D55=0,\"\",LEFT('PJ-JV'!C55,6))","v":""},{"$f":"IF('PJ-JV'!D55=0,\"\",ROUND('PJ-JV'!D55,2))","v":""},{"$f":"IF('PJ-JV'!D55=0,\"\",LEFT('PJ-JV'!E55,6))","v":""},{"$f":"IF('PJ-JV'!D55=0,\"\",PROPER(LEFT('PJ-JV'!F55,4)))","v":""},{"$f":"IF('PJ-JV'!D55=0,\"\",LEFT('PJ-JV'!G55,9))","v":""},{"$f":"IF('PJ-JV'!D55=0,\"\",LEFT('PJ-JV'!H55,6))","v":""},{"$f":"IF('PJ-JV'!D55=0,\"\",LEFT('PJ-JV'!I55,24))","v":""},{"$f":"IF('PJ-JV'!D55=0,\"\",LEFT('PJ-JV'!J55,18))","v":""},{"$f":"IF('PJ-JV'!D55=0,\"\",LEFT('PJ-JV'!K55,50))","v":""},{"$f":"IF('PJ-JV'!D55=0,\"\",LEFT('PJ-JV'!L55,8))","v":""},{"$f":"IF('PJ-JV'!D55=0,\"\",LEFT('PJ-JV'!M55,10))","v":""},{"$f":"IF('PJ-JV'!D55=0,\"\",LEFT('PJ-JV'!N55,3))","v":""},{"$f":"IF('PJ-JV'!D55=0,\"\",LEFT('PJ-JV'!O55,6))","v":""},{"$f":"IF('PJ-JV'!D55=0,\"\",LEFT('PJ-JV'!P55,4))","v":""},{"$f":"IF('PJ-JV'!D55=0,\"\",LEFT('PJ-JV'!Q55,5))","v":""},{"$f":"IF('PJ-JV'!D55=0,\"\",LEFT('PJ-JV'!R55,4))","v":""},{"$f":"IF('PJ-JV'!D55=0,\"\",LEFT('PJ-JV'!S55,12))","v":""},{"$f":"IF('PJ-JV'!D55=0,\"\",LEFT('PJ-JV'!T55,12))","v":""},{"$f":"IF('PJ-JV'!D55=0,\"\",LEFT('PJ-JV'!U55,20))","v":""}]
[{"$f":"IF('PJ-JV'!D56=0,\"\",\"IT\")","v":""},null,{"$f":"IF('PJ-JV'!D56=0,\"\",'PJ-JV'!B56)","v":""},null,null,null,null,null,null,null,null,{"$f":"IF('PJ-JV'!D56=0,\"\",LEFT('PJ-JV'!C56,6))","v":""},{"$f":"IF('PJ-JV'!D56=0,\"\",ROUND('PJ-JV'!D56,2))","v":""},{"$f":"IF('PJ-JV'!D56=0,\"\",LEFT('PJ-JV'!E56,6))","v":""},{"$f":"IF('PJ-JV'!D56=0,\"\",PROPER(LEFT('PJ-JV'!F56,4)))","v":""},{"$f":"IF('PJ-JV'!D56=0,\"\",LEFT('PJ-JV'!G56,9))","v":""},{"$f":"IF('PJ-JV'!D56=0,\"\",LEFT('PJ-JV'!H56,6))","v":""},{"$f":"IF('PJ-JV'!D56=0,\"\",LEFT('PJ-JV'!I56,24))","v":""},{"$f":"IF('PJ-JV'!D56=0,\"\",LEFT('PJ-JV'!J56,18))","v":""},{"$f":"IF('PJ-JV'!D56=0,\"\",LEFT('PJ-JV'!K56,50))","v":""},{"$f":"IF('PJ-JV'!D56=0,\"\",LEFT('PJ-JV'!L56,8))","v":""},{"$f":"IF('PJ-JV'!D56=0,\"\",LEFT('PJ-JV'!M56,10))","v":""},{"$f":"IF('PJ-JV'!D56=0,\"\",LEFT('PJ-JV'!N56,3))","v":""},{"$f":"IF('PJ-JV'!D56=0,\"\",LEFT('PJ-JV'!O56,6))","v":""},{"$f":"IF('PJ-JV'!D56=0,\"\",LEFT('PJ-JV'!P56,4))","v":""},{"$f":"IF('PJ-JV'!D56=0,\"\",LEFT('PJ-JV'!Q56,5))","v":""},{"$f":"IF('PJ-JV'!D56=0,\"\",LEFT('PJ-JV'!R56,4))","v":""},{"$f":"IF('PJ-JV'!D56=0,\"\",LEFT('PJ-JV'!S56,12))","v":""},{"$f":"IF('PJ-JV'!D56=0,\"\",LEFT('PJ-JV'!T56,12))","v":""},{"$f":"IF('PJ-JV'!D56=0,\"\",LEFT('PJ-JV'!U56,20))","v":""}]
[{"$f":"IF('PJ-JV'!D57=0,\"\",\"IT\")","v":""},null,{"$f":"IF('PJ-JV'!D57=0,\"\",'PJ-JV'!B57)","v":""},null,null,null,null,null,null,null,null,{"$f":"IF('PJ-JV'!D57=0,\"\",LEFT('PJ-JV'!C57,6))","v":""},{"$f":"IF('PJ-JV'!D57=0,\"\",ROUND('PJ-JV'!D57,2))","v":""},{"$f":"IF('PJ-JV'!D57=0,\"\",LEFT('PJ-JV'!E57,6))","v":""},{"$f":"IF('PJ-JV'!D57=0,\"\",PROPER(LEFT('PJ-JV'!F57,4)))","v":""},{"$f":"IF('PJ-JV'!D57=0,\"\",LEFT('PJ-JV'!G57,9))","v":""},{"$f":"IF('PJ-JV'!D57=0,\"\",LEFT('PJ-JV'!H57,6))","v":""},{"$f":"IF('PJ-JV'!D57=0,\"\",LEFT('PJ-JV'!I57,24))","v":""},{"$f":"IF('PJ-JV'!D57=0,\"\",LEFT('PJ-JV'!J57,18))","v":""},{"$f":"IF('PJ-JV'!D57=0,\"\",LEFT('PJ-JV'!K57,50))","v":""},{"$f":"IF('PJ-JV'!D57=0,\"\",LEFT('PJ-JV'!L57,8))","v":""},{"$f":"IF('PJ-JV'!D57=0,\"\",LEFT('PJ-JV'!M57,10))","v":""},{"$f":"IF('PJ-JV'!D57=0,\"\",LEFT('PJ-JV'!N57,3))","v":""},{"$f":"IF('PJ-JV'!D57=0,\"\",LEFT('PJ-JV'!O57,6))","v":""},{"$f":"IF('PJ-JV'!D57=0,\"\",LEFT('PJ-JV'!P57,4))","v":""},{"$f":"IF('PJ-JV'!D57=0,\"\",LEFT('PJ-JV'!Q57,5))","v":""},{"$f":"IF('PJ-JV'!D57=0,\"\",LEFT('PJ-JV'!R57,4))","v":""},{"$f":"IF('PJ-JV'!D57=0,\"\",LEFT('PJ-JV'!S57,12))","v":""},{"$f":"IF('PJ-JV'!D57=0,\"\",LEFT('PJ-JV'!T57,12))","v":""},{"$f":"IF('PJ-JV'!D57=0,\"\",LEFT('PJ-JV'!U57,20))","v":""}]
[{"$f":"IF('PJ-JV'!D58=0,\"\",\"IT\")","v":""},null,{"$f":"IF('PJ-JV'!D58=0,\"\",'PJ-JV'!B58)","v":""},null,null,null,null,null,null,null,null,{"$f":"IF('PJ-JV'!D58=0,\"\",LEFT('PJ-JV'!C58,6))","v":""},{"$f":"IF('PJ-JV'!D58=0,\"\",ROUND('PJ-JV'!D58,2))","v":""},{"$f":"IF('PJ-JV'!D58=0,\"\",LEFT('PJ-JV'!E58,6))","v":""},{"$f":"IF('PJ-JV'!D58=0,\"\",PROPER(LEFT('PJ-JV'!F58,4)))","v":""},{"$f":"IF('PJ-JV'!D58=0,\"\",LEFT('PJ-JV'!G58,9))","v":""},{"$f":"IF('PJ-JV'!D58=0,\"\",LEFT('PJ-JV'!H58,6))","v":""},{"$f":"IF('PJ-JV'!D58=0,\"\",LEFT('PJ-JV'!I58,24))","v":""},{"$f":"IF('PJ-JV'!D58=0,\"\",LEFT('PJ-JV'!J58,18))","v":""},{"$f":"IF('PJ-JV'!D58=0,\"\",LEFT('PJ-JV'!K58,50))","v":""},{"$f":"IF('PJ-JV'!D58=0,\"\",LEFT('PJ-JV'!L58,8))","v":""},{"$f":"IF('PJ-JV'!D58=0,\"\",LEFT('PJ-JV'!M58,10))","v":""},{"$f":"IF('PJ-JV'!D58=0,\"\",LEFT('PJ-JV'!N58,3))","v":""},{"$f":"IF('PJ-JV'!D58=0,\"\",LEFT('PJ-JV'!O58,6))","v":""},{"$f":"IF('PJ-JV'!D58=0,\"\",LEFT('PJ-JV'!P58,4))","v":""},{"$f":"IF('PJ-JV'!D58=0,\"\",LEFT('PJ-JV'!Q58,5))","v":""},{"$f":"IF('PJ-JV'!D58=0,\"\",LEFT('PJ-JV'!R58,4))","v":""},{"$f":"IF('PJ-JV'!D58=0,\"\",LEFT('PJ-JV'!S58,12))","v":""},{"$f":"IF('PJ-JV'!D58=0,\"\",LEFT('PJ-JV'!T58,12))","v":""},{"$f":"IF('PJ-JV'!D58=0,\"\",LEFT('PJ-JV'!U58,20))","v":""}]
[{"$f":"IF('PJ-JV'!D59=0,\"\",\"IT\")","v":""},null,{"$f":"IF('PJ-JV'!D59=0,\"\",'PJ-JV'!B59)","v":""},null,null,null,null,null,null,null,null,{"$f":"IF('PJ-JV'!D59=0,\"\",LEFT('PJ-JV'!C59,6))","v":""},{"$f":"IF('PJ-JV'!D59=0,\"\",ROUND('PJ-JV'!D59,2))","v":""},{"$f":"IF('PJ-JV'!D59=0,\"\",LEFT('PJ-JV'!E59,6))","v":""},{"$f":"IF('PJ-JV'!D59=0,\"\",PROPER(LEFT('PJ-JV'!F59,4)))","v":""},{"$f":"IF('PJ-JV'!D59=0,\"\",LEFT('PJ-JV'!G59,9))","v":""},{"$f":"IF('PJ-JV'!D59=0,\"\",LEFT('PJ-JV'!H59,6))","v":""},{"$f":"IF('PJ-JV'!D59=0,\"\",LEFT('PJ-JV'!I59,24))","v":""},{"$f":"IF('PJ-JV'!D59=0,\"\",LEFT('PJ-JV'!J59,18))","v":""},{"$f":"IF('PJ-JV'!D59=0,\"\",LEFT('PJ-JV'!K59,50))","v":""},{"$f":"IF('PJ-JV'!D59=0,\"\",LEFT('PJ-JV'!L59,8))","v":""},{"$f":"IF('PJ-JV'!D59=0,\"\",LEFT('PJ-JV'!M59,10))","v":""},{"$f":"IF('PJ-JV'!D59=0,\"\",LEFT('PJ-JV'!N59,3))","v":""},{"$f":"IF('PJ-JV'!D59=0,\"\",LEFT('PJ-JV'!O59,6))","v":""},{"$f":"IF('PJ-JV'!D59=0,\"\",LEFT('PJ-JV'!P59,4))","v":""},{"$f":"IF('PJ-JV'!D59=0,\"\",LEFT('PJ-JV'!Q59,5))","v":""},{"$f":"IF('PJ-JV'!D59=0,\"\",LEFT('PJ-JV'!R59,4))","v":""},{"$f":"IF('PJ-JV'!D59=0,\"\",LEFT('PJ-JV'!S59,12))","v":""},{"$f":"IF('PJ-JV'!D59=0,\"\",LEFT('PJ-JV'!T59,12))","v":""},{"$f":"IF('PJ-JV'!D59=0,\"\",LEFT('PJ-JV'!U59,20))","v":""}]
[{"$f":"IF('PJ-JV'!D60=0,\"\",\"IT\")","v":""},null,{"$f":"IF('PJ-JV'!D60=0,\"\",'PJ-JV'!B60)","v":""},null,null,null,null,null,null,null,null,{"$f":"IF('PJ-JV'!D60=0,\"\",LEFT('PJ-JV'!C60,6))","v":""},{"$f":"IF('PJ-JV'!D60=0,\"\",ROUND('PJ-JV'!D60,2))","v":""},{"$f":"IF('PJ-JV'!D60=0,\"\",LEFT('PJ-JV'!E60,6))","v":""},{"$f":"IF('PJ-JV'!D60=0,\"\",PROPER(LEFT('PJ-JV'!F60,4)))","v":""},{"$f":"IF('PJ-JV'!D60=0,\"\",LEFT('PJ-JV'!G60,9))","v":""},{"$f":"IF('PJ-JV'!D60=0,\"\",LEFT('PJ-JV'!H60,6))","v":""},{"$f":"IF('PJ-JV'!D60=0,\"\",LEFT('PJ-JV'!I60,24))","v":""},{"$f":"IF('PJ-JV'!D60=0,\"\",LEFT('PJ-JV'!J60,18))","v":""},{"$f":"IF('PJ-JV'!D60=0,\"\",LEFT('PJ-JV'!K60,50))","v":""},{"$f":"IF('PJ-JV'!D60=0,\"\",LEFT('PJ-JV'!L60,8))","v":""},{"$f":"IF('PJ-JV'!D60=0,\"\",LEFT('PJ-JV'!M60,10))","v":""},{"$f":"IF('PJ-JV'!D60=0,\"\",LEFT('PJ-JV'!N60,3))","v":""},{"$f":"IF('PJ-JV'!D60=0,\"\",LEFT('PJ-JV'!O60,6))","v":""},{"$f":"IF('PJ-JV'!D60=0,\"\",LEFT('PJ-JV'!P60,4))","v":""},{"$f":"IF('PJ-JV'!D60=0,\"\",LEFT('PJ-JV'!Q60,5))","v":""},{"$f":"IF('PJ-JV'!D60=0,\"\",LEFT('PJ-JV'!R60,4))","v":""},{"$f":"IF('PJ-JV'!D60=0,\"\",LEFT('PJ-JV'!S60,12))","v":""},{"$f":"IF('PJ-JV'!D60=0,\"\",LEFT('PJ-JV'!T60,12))","v":""},{"$f":"IF('PJ-JV'!D60=0,\"\",LEFT('PJ-JV'!U60,20))","v":""}]
[{"$f":"IF('PJ-JV'!D61=0,\"\",\"IT\")","v":""},null,{"$f":"IF('PJ-JV'!D61=0,\"\",'PJ-JV'!B61)","v":""},null,null,null,null,null,null,null,null,{"$f":"IF('PJ-JV'!D61=0,\"\",LEFT('PJ-JV'!C61,6))","v":""},{"$f":"IF('PJ-JV'!D61=0,\"\",ROUND('PJ-JV'!D61,2))","v":""},{"$f":"IF('PJ-JV'!D61=0,\"\",LEFT('PJ-JV'!E61,6))","v":""},{"$f":"IF('PJ-JV'!D61=0,\"\",PROPER(LEFT('PJ-JV'!F61,4)))","v":""},{"$f":"IF('PJ-JV'!D61=0,\"\",LEFT('PJ-JV'!G61,9))","v":""},{"$f":"IF('PJ-JV'!D61=0,\"\",LEFT('PJ-JV'!H61,6))","v":""},{"$f":"IF('PJ-JV'!D61=0,\"\",LEFT('PJ-JV'!I61,24))","v":""},{"$f":"IF('PJ-JV'!D61=0,\"\",LEFT('PJ-JV'!J61,18))","v":""},{"$f":"IF('PJ-JV'!D61=0,\"\",LEFT('PJ-JV'!K61,50))","v":""},{"$f":"IF('PJ-JV'!D61=0,\"\",LEFT('PJ-JV'!L61,8))","v":""},{"$f":"IF('PJ-JV'!D61=0,\"\",LEFT('PJ-JV'!M61,10))","v":""},{"$f":"IF('PJ-JV'!D61=0,\"\",LEFT('PJ-JV'!N61,3))","v":""},{"$f":"IF('PJ-JV'!D61=0,\"\",LEFT('PJ-JV'!O61,6))","v":""},{"$f":"IF('PJ-JV'!D61=0,\"\",LEFT('PJ-JV'!P61,4))","v":""},{"$f":"IF('PJ-JV'!D61=0,\"\",LEFT('PJ-JV'!Q61,5))","v":""},{"$f":"IF('PJ-JV'!D61=0,\"\",LEFT('PJ-JV'!R61,4))","v":""},{"$f":"IF('PJ-JV'!D61=0,\"\",LEFT('PJ-JV'!S61,12))","v":""},{"$f":"IF('PJ-JV'!D61=0,\"\",LEFT('PJ-JV'!T61,12))","v":""},{"$f":"IF('PJ-JV'!D61=0,\"\",LEFT('PJ-JV'!U61,20))","v":""}]
[{"$f":"IF('PJ-JV'!D62=0,\"\",\"IT\")","v":""},null,{"$f":"IF('PJ-JV'!D62=0,\"\",'PJ-JV'!B62)","v":""},null,null,null,null,null,null,null,null,{"$f":"IF('PJ-JV'!D62=0,\"\",LEFT('PJ-JV'!C62,6))","v":""},{"$f":"IF('PJ-JV'!D62=0,\"\",ROUND('PJ-JV'!D62,2))","v":""},{"$f":"IF('PJ-JV'!D62=0,\"\",LEFT('PJ-JV'!E62,6))","v":""},{"$f":"IF('PJ-JV'!D62=0,\"\",PROPER(LEFT('PJ-JV'!F62,4)))","v":""},{"$f":"IF('PJ-JV'!D62=0,\"\",LEFT('PJ-JV'!G62,9))","v":""},{"$f":"IF('PJ-JV'!D62=0,\"\",LEFT('PJ-JV'!H62,6))","v":""},{"$f":"IF('PJ-JV'!D62=0,\"\",LEFT('PJ-JV'!I62,24))","v":""},{"$f":"IF('PJ-JV'!D62=0,\"\",LEFT('PJ-JV'!J62,18))","v":""},{"$f":"IF('PJ-JV'!D62=0,\"\",LEFT('PJ-JV'!K62,50))","v":""},{"$f":"IF('PJ-JV'!D62=0,\"\",LEFT('PJ-JV'!L62,8))","v":""},{"$f":"IF('PJ-JV'!D62=0,\"\",LEFT('PJ-JV'!M62,10))","v":""},{"$f":"IF('PJ-JV'!D62=0,\"\",LEFT('PJ-JV'!N62,3))","v":""},{"$f":"IF('PJ-JV'!D62=0,\"\",LEFT('PJ-JV'!O62,6))","v":""},{"$f":"IF('PJ-JV'!D62=0,\"\",LEFT('PJ-JV'!P62,4))","v":""},{"$f":"IF('PJ-JV'!D62=0,\"\",LEFT('PJ-JV'!Q62,5))","v":""},{"$f":"IF('PJ-JV'!D62=0,\"\",LEFT('PJ-JV'!R62,4))","v":""},{"$f":"IF('PJ-JV'!D62=0,\"\",LEFT('PJ-JV'!S62,12))","v":""},{"$f":"IF('PJ-JV'!D62=0,\"\",LEFT('PJ-JV'!T62,12))","v":""},{"$f":"IF('PJ-JV'!D62=0,\"\",LEFT('PJ-JV'!U62,20))","v":""}]
[{"$f":"IF('PJ-JV'!D63=0,\"\",\"IT\")","v":""},null,{"$f":"IF('PJ-JV'!D63=0,\"\",'PJ-JV'!B63)","v":""},null,null,null,null,null,null,null,null,{"$f":"IF('PJ-JV'!D63=0,\"\",LEFT('PJ-JV'!C63,6))","v":""},{"$f":"IF('PJ-JV'!D63=0,\"\",ROUND('PJ-JV'!D63,2))","v":""},{"$f":"IF('PJ-JV'!D63=0,\"\",LEFT('PJ-JV'!E63,6))","v":""},{"$f":"IF('PJ-JV'!D63=0,\"\",PROPER(LEFT('PJ-JV'!F63,4)))","v":""},{"$f":"IF('PJ-JV'!D63=0,\"\",LEFT('PJ-JV'!G63,9))","v":""},{"$f":"IF('PJ-JV'!D63=0,\"\",LEFT('PJ-JV'!H63,6))","v":""},{"$f":"IF('PJ-JV'!D63=0,\"\",LEFT('PJ-JV'!I63,24))","v":""},{"$f":"IF('PJ-JV'!D63=0,\"\",LEFT('PJ-JV'!J63,18))","v":""},{"$f":"IF('PJ-JV'!D63=0,\"\",LEFT('PJ-JV'!K63,50))","v":""},{"$f":"IF('PJ-JV'!D63=0,\"\",LEFT('PJ-JV'!L63,8))","v":""},{"$f":"IF('PJ-JV'!D63=0,\"\",LEFT('PJ-JV'!M63,10))","v":""},{"$f":"IF('PJ-JV'!D63=0,\"\",LEFT('PJ-JV'!N63,3))","v":""},{"$f":"IF('PJ-JV'!D63=0,\"\",LEFT('PJ-JV'!O63,6))","v":""},{"$f":"IF('PJ-JV'!D63=0,\"\",LEFT('PJ-JV'!P63,4))","v":""},{"$f":"IF('PJ-JV'!D63=0,\"\",LEFT('PJ-JV'!Q63,5))","v":""},{"$f":"IF('PJ-JV'!D63=0,\"\",LEFT('PJ-JV'!R63,4))","v":""},{"$f":"IF('PJ-JV'!D63=0,\"\",LEFT('PJ-JV'!S63,12))","v":""},{"$f":"IF('PJ-JV'!D63=0,\"\",LEFT('PJ-JV'!T63,12))","v":""},{"$f":"IF('PJ-JV'!D63=0,\"\",LEFT('PJ-JV'!U63,20))","v":""}]
[{"$f":"IF('PJ-JV'!D64=0,\"\",\"IT\")","v":""},null,{"$f":"IF('PJ-JV'!D64=0,\"\",'PJ-JV'!B64)","v":""},null,null,null,null,null,null,null,null,{"$f":"IF('PJ-JV'!D64=0,\"\",LEFT('PJ-JV'!C64,6))","v":""},{"$f":"IF('PJ-JV'!D64=0,\"\",ROUND('PJ-JV'!D64,2))","v":""},{"$f":"IF('PJ-JV'!D64=0,\"\",LEFT('PJ-JV'!E64,6))","v":""},{"$f":"IF('PJ-JV'!D64=0,\"\",PROPER(LEFT('PJ-JV'!F64,4)))","v":""},{"$f":"IF('PJ-JV'!D64=0,\"\",LEFT('PJ-JV'!G64,9))","v":""},{"$f":"IF('PJ-JV'!D64=0,\"\",LEFT('PJ-JV'!H64,6))","v":""},{"$f":"IF('PJ-JV'!D64=0,\"\",LEFT('PJ-JV'!I64,24))","v":""},{"$f":"IF('PJ-JV'!D64=0,\"\",LEFT('PJ-JV'!J64,18))","v":""},{"$f":"IF('PJ-JV'!D64=0,\"\",LEFT('PJ-JV'!K64,50))","v":""},{"$f":"IF('PJ-JV'!D64=0,\"\",LEFT('PJ-JV'!L64,8))","v":""},{"$f":"IF('PJ-JV'!D64=0,\"\",LEFT('PJ-JV'!M64,10))","v":""},{"$f":"IF('PJ-JV'!D64=0,\"\",LEFT('PJ-JV'!N64,3))","v":""},{"$f":"IF('PJ-JV'!D64=0,\"\",LEFT('PJ-JV'!O64,6))","v":""},{"$f":"IF('PJ-JV'!D64=0,\"\",LEFT('PJ-JV'!P64,4))","v":""},{"$f":"IF('PJ-JV'!D64=0,\"\",LEFT('PJ-JV'!Q64,5))","v":""},{"$f":"IF('PJ-JV'!D64=0,\"\",LEFT('PJ-JV'!R64,4))","v":""},{"$f":"IF('PJ-JV'!D64=0,\"\",LEFT('PJ-JV'!S64,12))","v":""},{"$f":"IF('PJ-JV'!D64=0,\"\",LEFT('PJ-JV'!T64,12))","v":""},{"$f":"IF('PJ-JV'!D64=0,\"\",LEFT('PJ-JV'!U64,20))","v":""}]
[{"$f":"IF('PJ-JV'!D65=0,\"\",\"IT\")","v":""},null,{"$f":"IF('PJ-JV'!D65=0,\"\",'PJ-JV'!B65)","v":""},null,null,null,null,null,null,null,null,{"$f":"IF('PJ-JV'!D65=0,\"\",LEFT('PJ-JV'!C65,6))","v":""},{"$f":"IF('PJ-JV'!D65=0,\"\",ROUND('PJ-JV'!D65,2))","v":""},{"$f":"IF('PJ-JV'!D65=0,\"\",LEFT('PJ-JV'!E65,6))","v":""},{"$f":"IF('PJ-JV'!D65=0,\"\",PROPER(LEFT('PJ-JV'!F65,4)))","v":""},{"$f":"IF('PJ-JV'!D65=0,\"\",LEFT('PJ-JV'!G65,9))","v":""},{"$f":"IF('PJ-JV'!D65=0,\"\",LEFT('PJ-JV'!H65,6))","v":""},{"$f":"IF('PJ-JV'!D65=0,\"\",LEFT('PJ-JV'!I65,24))","v":""},{"$f":"IF('PJ-JV'!D65=0,\"\",LEFT('PJ-JV'!J65,18))","v":""},{"$f":"IF('PJ-JV'!D65=0,\"\",LEFT('PJ-JV'!K65,50))","v":""},{"$f":"IF('PJ-JV'!D65=0,\"\",LEFT('PJ-JV'!L65,8))","v":""},{"$f":"IF('PJ-JV'!D65=0,\"\",LEFT('PJ-JV'!M65,10))","v":""},{"$f":"IF('PJ-JV'!D65=0,\"\",LEFT('PJ-JV'!N65,3))","v":""},{"$f":"IF('PJ-JV'!D65=0,\"\",LEFT('PJ-JV'!O65,6))","v":""},{"$f":"IF('PJ-JV'!D65=0,\"\",LEFT('PJ-JV'!P65,4))","v":""},{"$f":"IF('PJ-JV'!D65=0,\"\",LEFT('PJ-JV'!Q65,5))","v":""},{"$f":"IF('PJ-JV'!D65=0,\"\",LEFT('PJ-JV'!R65,4))","v":""},{"$f":"IF('PJ-JV'!D65=0,\"\",LEFT('PJ-JV'!S65,12))","v":""},{"$f":"IF('PJ-JV'!D65=0,\"\",LEFT('PJ-JV'!T65,12))","v":""},{"$f":"IF('PJ-JV'!D65=0,\"\",LEFT('PJ-JV'!U65,20))","v":""}]
[{"$f":"IF('PJ-JV'!D66=0,\"\",\"IT\")","v":""},null,{"$f":"IF('PJ-JV'!D66=0,\"\",'PJ-JV'!B66)","v":""},null,null,null,null,null,null,null,null,{"$f":"IF('PJ-JV'!D66=0,\"\",LEFT('PJ-JV'!C66,6))","v":""},{"$f":"IF('PJ-JV'!D66=0,\"\",ROUND('PJ-JV'!D66,2))","v":""},{"$f":"IF('PJ-JV'!D66=0,\"\",LEFT('PJ-JV'!E66,6))","v":""},{"$f":"IF('PJ-JV'!D66=0,\"\",PROPER(LEFT('PJ-JV'!F66,4)))","v":""},{"$f":"IF('PJ-JV'!D66=0,\"\",LEFT('PJ-JV'!G66,9))","v":""},{"$f":"IF('PJ-JV'!D66=0,\"\",LEFT('PJ-JV'!H66,6))","v":""},{"$f":"IF('PJ-JV'!D66=0,\"\",LEFT('PJ-JV'!I66,24))","v":""},{"$f":"IF('PJ-JV'!D66=0,\"\",LEFT('PJ-JV'!J66,18))","v":""},{"$f":"IF('PJ-JV'!D66=0,\"\",LEFT('PJ-JV'!K66,50))","v":""},{"$f":"IF('PJ-JV'!D66=0,\"\",LEFT('PJ-JV'!L66,8))","v":""},{"$f":"IF('PJ-JV'!D66=0,\"\",LEFT('PJ-JV'!M66,10))","v":""},{"$f":"IF('PJ-JV'!D66=0,\"\",LEFT('PJ-JV'!N66,3))","v":""},{"$f":"IF('PJ-JV'!D66=0,\"\",LEFT('PJ-JV'!O66,6))","v":""},{"$f":"IF('PJ-JV'!D66=0,\"\",LEFT('PJ-JV'!P66,4))","v":""},{"$f":"IF('PJ-JV'!D66=0,\"\",LEFT('PJ-JV'!Q66,5))","v":""},{"$f":"IF('PJ-JV'!D66=0,\"\",LEFT('PJ-JV'!R66,4))","v":""},{"$f":"IF('PJ-JV'!D66=0,\"\",LEFT('PJ-JV'!S66,12))","v":""},{"$f":"IF('PJ-JV'!D66=0,\"\",LEFT('PJ-JV'!T66,12))","v":""},{"$f":"IF('PJ-JV'!D66=0,\"\",LEFT('PJ-JV'!U66,20))","v":""}]
[{"$f":"IF('PJ-JV'!D67=0,\"\",\"IT\")","v":""},null,{"$f":"IF('PJ-JV'!D67=0,\"\",'PJ-JV'!B67)","v":""},null,null,null,null,null,null,null,null,{"$f":"IF('PJ-JV'!D67=0,\"\",LEFT('PJ-JV'!C67,6))","v":""},{"$f":"IF('PJ-JV'!D67=0,\"\",ROUND('PJ-JV'!D67,2))","v":""},{"$f":"IF('PJ-JV'!D67=0,\"\",LEFT('PJ-JV'!E67,6))","v":""},{"$f":"IF('PJ-JV'!D67=0,\"\",PROPER(LEFT('PJ-JV'!F67,4)))","v":""},{"$f":"IF('PJ-JV'!D67=0,\"\",LEFT('PJ-JV'!G67,9))","v":""},{"$f":"IF('PJ-JV'!D67=0,\"\",LEFT('PJ-JV'!H67,6))","v":""},{"$f":"IF('PJ-JV'!D67=0,\"\",LEFT('PJ-JV'!I67,24))","v":""},{"$f":"IF('PJ-JV'!D67=0,\"\",LEFT('PJ-JV'!J67,18))","v":""},{"$f":"IF('PJ-JV'!D67=0,\"\",LEFT('PJ-JV'!K67,50))","v":""},{"$f":"IF('PJ-JV'!D67=0,\"\",LEFT('PJ-JV'!L67,8))","v":""},{"$f":"IF('PJ-JV'!D67=0,\"\",LEFT('PJ-JV'!M67,10))","v":""},{"$f":"IF('PJ-JV'!D67=0,\"\",LEFT('PJ-JV'!N67,3))","v":""},{"$f":"IF('PJ-JV'!D67=0,\"\",LEFT('PJ-JV'!O67,6))","v":""},{"$f":"IF('PJ-JV'!D67=0,\"\",LEFT('PJ-JV'!P67,4))","v":""},{"$f":"IF('PJ-JV'!D67=0,\"\",LEFT('PJ-JV'!Q67,5))","v":""},{"$f":"IF('PJ-JV'!D67=0,\"\",LEFT('PJ-JV'!R67,4))","v":""},{"$f":"IF('PJ-JV'!D67=0,\"\",LEFT('PJ-JV'!S67,12))","v":""},{"$f":"IF('PJ-JV'!D67=0,\"\",LEFT('PJ-JV'!T67,12))","v":""},{"$f":"IF('PJ-JV'!D67=0,\"\",LEFT('PJ-JV'!U67,20))","v":""}]
[{"$f":"IF('PJ-JV'!D68=0,\"\",\"IT\")","v":""},null,{"$f":"IF('PJ-JV'!D68=0,\"\",'PJ-JV'!B68)","v":""},null,null,null,null,null,null,null,null,{"$f":"IF('PJ-JV'!D68=0,\"\",LEFT('PJ-JV'!C68,6))","v":""},{"$f":"IF('PJ-JV'!D68=0,\"\",ROUND('PJ-JV'!D68,2))","v":""},{"$f":"IF('PJ-JV'!D68=0,\"\",LEFT('PJ-JV'!E68,6))","v":""},{"$f":"IF('PJ-JV'!D68=0,\"\",PROPER(LEFT('PJ-JV'!F68,4)))","v":""},{"$f":"IF('PJ-JV'!D68=0,\"\",LEFT('PJ-JV'!G68,9))","v":""},{"$f":"IF('PJ-JV'!D68=0,\"\",LEFT('PJ-JV'!H68,6))","v":""},{"$f":"IF('PJ-JV'!D68=0,\"\",LEFT('PJ-JV'!I68,24))","v":""},{"$f":"IF('PJ-JV'!D68=0,\"\",LEFT('PJ-JV'!J68,18))","v":""},{"$f":"IF('PJ-JV'!D68=0,\"\",LEFT('PJ-JV'!K68,50))","v":""},{"$f":"IF('PJ-JV'!D68=0,\"\",LEFT('PJ-JV'!L68,8))","v":""},{"$f":"IF('PJ-JV'!D68=0,\"\",LEFT('PJ-JV'!M68,10))","v":""},{"$f":"IF('PJ-JV'!D68=0,\"\",LEFT('PJ-JV'!N68,3))","v":""},{"$f":"IF('PJ-JV'!D68=0,\"\",LEFT('PJ-JV'!O68,6))","v":""},{"$f":"IF('PJ-JV'!D68=0,\"\",LEFT('PJ-JV'!P68,4))","v":""},{"$f":"IF('PJ-JV'!D68=0,\"\",LEFT('PJ-JV'!Q68,5))","v":""},{"$f":"IF('PJ-JV'!D68=0,\"\",LEFT('PJ-JV'!R68,4))","v":""},{"$f":"IF('PJ-JV'!D68=0,\"\",LEFT('PJ-JV'!S68,12))","v":""},{"$f":"IF('PJ-JV'!D68=0,\"\",LEFT('PJ-JV'!T68,12))","v":""},{"$f":"IF('PJ-JV'!D68=0,\"\",LEFT('PJ-JV'!U68,20))","v":""}]
[{"$f":"IF('PJ-JV'!D69=0,\"\",\"IT\")","v":""},null,{"$f":"IF('PJ-JV'!D69=0,\"\",'PJ-JV'!B69)","v":""},null,null,null,null,null,null,null,null,{"$f":"IF('PJ-JV'!D69=0,\"\",LEFT('PJ-JV'!C69,6))","v":""},{"$f":"IF('PJ-JV'!D69=0,\"\",ROUND('PJ-JV'!D69,2))","v":""},{"$f":"IF('PJ-JV'!D69=0,\"\",LEFT('PJ-JV'!E69,6))","v":""},{"$f":"IF('PJ-JV'!D69=0,\"\",PROPER(LEFT('PJ-JV'!F69,4)))","v":""},{"$f":"IF('PJ-JV'!D69=0,\"\",LEFT('PJ-JV'!G69,9))","v":""},{"$f":"IF('PJ-JV'!D69=0,\"\",LEFT('PJ-JV'!H69,6))","v":""},{"$f":"IF('PJ-JV'!D69=0,\"\",LEFT('PJ-JV'!I69,24))","v":""},{"$f":"IF('PJ-JV'!D69=0,\"\",LEFT('PJ-JV'!J69,18))","v":""},{"$f":"IF('PJ-JV'!D69=0,\"\",LEFT('PJ-JV'!K69,50))","v":""},{"$f":"IF('PJ-JV'!D69=0,\"\",LEFT('PJ-JV'!L69,8))","v":""},{"$f":"IF('PJ-JV'!D69=0,\"\",LEFT('PJ-JV'!M69,10))","v":""},{"$f":"IF('PJ-JV'!D69=0,\"\",LEFT('PJ-JV'!N69,3))","v":""},{"$f":"IF('PJ-JV'!D69=0,\"\",LEFT('PJ-JV'!O69,6))","v":""},{"$f":"IF('PJ-JV'!D69=0,\"\",LEFT('PJ-JV'!P69,4))","v":""},{"$f":"IF('PJ-JV'!D69=0,\"\",LEFT('PJ-JV'!Q69,5))","v":""},{"$f":"IF('PJ-JV'!D69=0,\"\",LEFT('PJ-JV'!R69,4))","v":""},{"$f":"IF('PJ-JV'!D69=0,\"\",LEFT('PJ-JV'!S69,12))","v":""},{"$f":"IF('PJ-JV'!D69=0,\"\",LEFT('PJ-JV'!T69,12))","v":""},{"$f":"IF('PJ-JV'!D69=0,\"\",LEFT('PJ-JV'!U69,20))","v":""}]
[{"$f":"IF('PJ-JV'!D70=0,\"\",\"IT\")","v":""},null,{"$f":"IF('PJ-JV'!D70=0,\"\",'PJ-JV'!B70)","v":""},null,null,null,null,null,null,null,null,{"$f":"IF('PJ-JV'!D70=0,\"\",LEFT('PJ-JV'!C70,6))","v":""},{"$f":"IF('PJ-JV'!D70=0,\"\",ROUND('PJ-JV'!D70,2))","v":""},{"$f":"IF('PJ-JV'!D70=0,\"\",LEFT('PJ-JV'!E70,6))","v":""},{"$f":"IF('PJ-JV'!D70=0,\"\",PROPER(LEFT('PJ-JV'!F70,4)))","v":""},{"$f":"IF('PJ-JV'!D70=0,\"\",LEFT('PJ-JV'!G70,9))","v":""},{"$f":"IF('PJ-JV'!D70=0,\"\",LEFT('PJ-JV'!H70,6))","v":""},{"$f":"IF('PJ-JV'!D70=0,\"\",LEFT('PJ-JV'!I70,24))","v":""},{"$f":"IF('PJ-JV'!D70=0,\"\",LEFT('PJ-JV'!J70,18))","v":""},{"$f":"IF('PJ-JV'!D70=0,\"\",LEFT('PJ-JV'!K70,50))","v":""},{"$f":"IF('PJ-JV'!D70=0,\"\",LEFT('PJ-JV'!L70,8))","v":""},{"$f":"IF('PJ-JV'!D70=0,\"\",LEFT('PJ-JV'!M70,10))","v":""},{"$f":"IF('PJ-JV'!D70=0,\"\",LEFT('PJ-JV'!N70,3))","v":""},{"$f":"IF('PJ-JV'!D70=0,\"\",LEFT('PJ-JV'!O70,6))","v":""},{"$f":"IF('PJ-JV'!D70=0,\"\",LEFT('PJ-JV'!P70,4))","v":""},{"$f":"IF('PJ-JV'!D70=0,\"\",LEFT('PJ-JV'!Q70,5))","v":""},{"$f":"IF('PJ-JV'!D70=0,\"\",LEFT('PJ-JV'!R70,4))","v":""},{"$f":"IF('PJ-JV'!D70=0,\"\",LEFT('PJ-JV'!S70,12))","v":""},{"$f":"IF('PJ-JV'!D70=0,\"\",LEFT('PJ-JV'!T70,12))","v":""},{"$f":"IF('PJ-JV'!D70=0,\"\",LEFT('PJ-JV'!U70,20))","v":""}]
[{"$f":"IF('PJ-JV'!D71=0,\"\",\"IT\")","v":""},null,{"$f":"IF('PJ-JV'!D71=0,\"\",'PJ-JV'!B71)","v":""},null,null,null,null,null,null,null,null,{"$f":"IF('PJ-JV'!D71=0,\"\",LEFT('PJ-JV'!C71,6))","v":""},{"$f":"IF('PJ-JV'!D71=0,\"\",ROUND('PJ-JV'!D71,2))","v":""},{"$f":"IF('PJ-JV'!D71=0,\"\",LEFT('PJ-JV'!E71,6))","v":""},{"$f":"IF('PJ-JV'!D71=0,\"\",PROPER(LEFT('PJ-JV'!F71,4)))","v":""},{"$f":"IF('PJ-JV'!D71=0,\"\",LEFT('PJ-JV'!G71,9))","v":""},{"$f":"IF('PJ-JV'!D71=0,\"\",LEFT('PJ-JV'!H71,6))","v":""},{"$f":"IF('PJ-JV'!D71=0,\"\",LEFT('PJ-JV'!I71,24))","v":""},{"$f":"IF('PJ-JV'!D71=0,\"\",LEFT('PJ-JV'!J71,18))","v":""},{"$f":"IF('PJ-JV'!D71=0,\"\",LEFT('PJ-JV'!K71,50))","v":""},{"$f":"IF('PJ-JV'!D71=0,\"\",LEFT('PJ-JV'!L71,8))","v":""},{"$f":"IF('PJ-JV'!D71=0,\"\",LEFT('PJ-JV'!M71,10))","v":""},{"$f":"IF('PJ-JV'!D71=0,\"\",LEFT('PJ-JV'!N71,3))","v":""},{"$f":"IF('PJ-JV'!D71=0,\"\",LEFT('PJ-JV'!O71,6))","v":""},{"$f":"IF('PJ-JV'!D71=0,\"\",LEFT('PJ-JV'!P71,4))","v":""},{"$f":"IF('PJ-JV'!D71=0,\"\",LEFT('PJ-JV'!Q71,5))","v":""},{"$f":"IF('PJ-JV'!D71=0,\"\",LEFT('PJ-JV'!R71,4))","v":""},{"$f":"IF('PJ-JV'!D71=0,\"\",LEFT('PJ-JV'!S71,12))","v":""},{"$f":"IF('PJ-JV'!D71=0,\"\",LEFT('PJ-JV'!T71,12))","v":""},{"$f":"IF('PJ-JV'!D71=0,\"\",LEFT('PJ-JV'!U71,20))","v":""}]
[{"$f":"IF('PJ-JV'!D72=0,\"\",\"IT\")","v":""},null,{"$f":"IF('PJ-JV'!D72=0,\"\",'PJ-JV'!B72)","v":""},null,null,null,null,null,null,null,null,{"$f":"IF('PJ-JV'!D72=0,\"\",LEFT('PJ-JV'!C72,6))","v":""},{"$f":"IF('PJ-JV'!D72=0,\"\",ROUND('PJ-JV'!D72,2))","v":""},{"$f":"IF('PJ-JV'!D72=0,\"\",LEFT('PJ-JV'!E72,6))","v":""},{"$f":"IF('PJ-JV'!D72=0,\"\",PROPER(LEFT('PJ-JV'!F72,4)))","v":""},{"$f":"IF('PJ-JV'!D72=0,\"\",LEFT('PJ-JV'!G72,9))","v":""},{"$f":"IF('PJ-JV'!D72=0,\"\",LEFT('PJ-JV'!H72,6))","v":""},{"$f":"IF('PJ-JV'!D72=0,\"\",LEFT('PJ-JV'!I72,24))","v":""},{"$f":"IF('PJ-JV'!D72=0,\"\",LEFT('PJ-JV'!J72,18))","v":""},{"$f":"IF('PJ-JV'!D72=0,\"\",LEFT('PJ-JV'!K72,50))","v":""},{"$f":"IF('PJ-JV'!D72=0,\"\",LEFT('PJ-JV'!L72,8))","v":""},{"$f":"IF('PJ-JV'!D72=0,\"\",LEFT('PJ-JV'!M72,10))","v":""},{"$f":"IF('PJ-JV'!D72=0,\"\",LEFT('PJ-JV'!N72,3))","v":""},{"$f":"IF('PJ-JV'!D72=0,\"\",LEFT('PJ-JV'!O72,6))","v":""},{"$f":"IF('PJ-JV'!D72=0,\"\",LEFT('PJ-JV'!P72,4))","v":""},{"$f":"IF('PJ-JV'!D72=0,\"\",LEFT('PJ-JV'!Q72,5))","v":""},{"$f":"IF('PJ-JV'!D72=0,\"\",LEFT('PJ-JV'!R72,4))","v":""},{"$f":"IF('PJ-JV'!D72=0,\"\",LEFT('PJ-JV'!S72,12))","v":""},{"$f":"IF('PJ-JV'!D72=0,\"\",LEFT('PJ-JV'!T72,12))","v":""},{"$f":"IF('PJ-JV'!D72=0,\"\",LEFT('PJ-JV'!U72,20))","v":""}]
[{"$f":"IF('PJ-JV'!D73=0,\"\",\"IT\")","v":""},null,{"$f":"IF('PJ-JV'!D73=0,\"\",'PJ-JV'!B73)","v":""},null,null,null,null,null,null,null,null,{"$f":"IF('PJ-JV'!D73=0,\"\",LEFT('PJ-JV'!C73,6))","v":""},{"$f":"IF('PJ-JV'!D73=0,\"\",ROUND('PJ-JV'!D73,2))","v":""},{"$f":"IF('PJ-JV'!D73=0,\"\",LEFT('PJ-JV'!E73,6))","v":""},{"$f":"IF('PJ-JV'!D73=0,\"\",PROPER(LEFT('PJ-JV'!F73,4)))","v":""},{"$f":"IF('PJ-JV'!D73=0,\"\",LEFT('PJ-JV'!G73,9))","v":""},{"$f":"IF('PJ-JV'!D73=0,\"\",LEFT('PJ-JV'!H73,6))","v":""},{"$f":"IF('PJ-JV'!D73=0,\"\",LEFT('PJ-JV'!I73,24))","v":""},{"$f":"IF('PJ-JV'!D73=0,\"\",LEFT('PJ-JV'!J73,18))","v":""},{"$f":"IF('PJ-JV'!D73=0,\"\",LEFT('PJ-JV'!K73,50))","v":""},{"$f":"IF('PJ-JV'!D73=0,\"\",LEFT('PJ-JV'!L73,8))","v":""},{"$f":"IF('PJ-JV'!D73=0,\"\",LEFT('PJ-JV'!M73,10))","v":""},{"$f":"IF('PJ-JV'!D73=0,\"\",LEFT('PJ-JV'!N73,3))","v":""},{"$f":"IF('PJ-JV'!D73=0,\"\",LEFT('PJ-JV'!O73,6))","v":""},{"$f":"IF('PJ-JV'!D73=0,\"\",LEFT('PJ-JV'!P73,4))","v":""},{"$f":"IF('PJ-JV'!D73=0,\"\",LEFT('PJ-JV'!Q73,5))","v":""},{"$f":"IF('PJ-JV'!D73=0,\"\",LEFT('PJ-JV'!R73,4))","v":""},{"$f":"IF('PJ-JV'!D73=0,\"\",LEFT('PJ-JV'!S73,12))","v":""},{"$f":"IF('PJ-JV'!D73=0,\"\",LEFT('PJ-JV'!T73,12))","v":""},{"$f":"IF('PJ-JV'!D73=0,\"\",LEFT('PJ-JV'!U73,20))","v":""}]
[{"$f":"IF('PJ-JV'!D74=0,\"\",\"IT\")","v":""},null,{"$f":"IF('PJ-JV'!D74=0,\"\",'PJ-JV'!B74)","v":""},null,null,null,null,null,null,null,null,{"$f":"IF('PJ-JV'!D74=0,\"\",LEFT('PJ-JV'!C74,6))","v":""},{"$f":"IF('PJ-JV'!D74=0,\"\",ROUND('PJ-JV'!D74,2))","v":""},{"$f":"IF('PJ-JV'!D74=0,\"\",LEFT('PJ-JV'!E74,6))","v":""},{"$f":"IF('PJ-JV'!D74=0,\"\",PROPER(LEFT('PJ-JV'!F74,4)))","v":""},{"$f":"IF('PJ-JV'!D74=0,\"\",LEFT('PJ-JV'!G74,9))","v":""},{"$f":"IF('PJ-JV'!D74=0,\"\",LEFT('PJ-JV'!H74,6))","v":""},{"$f":"IF('PJ-JV'!D74=0,\"\",LEFT('PJ-JV'!I74,24))","v":""},{"$f":"IF('PJ-JV'!D74=0,\"\",LEFT('PJ-JV'!J74,18))","v":""},{"$f":"IF('PJ-JV'!D74=0,\"\",LEFT('PJ-JV'!K74,50))","v":""},{"$f":"IF('PJ-JV'!D74=0,\"\",LEFT('PJ-JV'!L74,8))","v":""},{"$f":"IF('PJ-JV'!D74=0,\"\",LEFT('PJ-JV'!M74,10))","v":""},{"$f":"IF('PJ-JV'!D74=0,\"\",LEFT('PJ-JV'!N74,3))","v":""},{"$f":"IF('PJ-JV'!D74=0,\"\",LEFT('PJ-JV'!O74,6))","v":""},{"$f":"IF('PJ-JV'!D74=0,\"\",LEFT('PJ-JV'!P74,4))","v":""},{"$f":"IF('PJ-JV'!D74=0,\"\",LEFT('PJ-JV'!Q74,5))","v":""},{"$f":"IF('PJ-JV'!D74=0,\"\",LEFT('PJ-JV'!R74,4))","v":""},{"$f":"IF('PJ-JV'!D74=0,\"\",LEFT('PJ-JV'!S74,12))","v":""},{"$f":"IF('PJ-JV'!D74=0,\"\",LEFT('PJ-JV'!T74,12))","v":""},{"$f":"IF('PJ-JV'!D74=0,\"\",LEFT('PJ-JV'!U74,20))","v":""}]
[{"$f":"IF('PJ-JV'!D75=0,\"\",\"IT\")","v":""},null,{"$f":"IF('PJ-JV'!D75=0,\"\",'PJ-JV'!B75)","v":""},null,null,null,null,null,null,null,null,{"$f":"IF('PJ-JV'!D75=0,\"\",LEFT('PJ-JV'!C75,6))","v":""},{"$f":"IF('PJ-JV'!D75=0,\"\",ROUND('PJ-JV'!D75,2))","v":""},{"$f":"IF('PJ-JV'!D75=0,\"\",LEFT('PJ-JV'!E75,6))","v":""},{"$f":"IF('PJ-JV'!D75=0,\"\",PROPER(LEFT('PJ-JV'!F75,4)))","v":""},{"$f":"IF('PJ-JV'!D75=0,\"\",LEFT('PJ-JV'!G75,9))","v":""},{"$f":"IF('PJ-JV'!D75=0,\"\",LEFT('PJ-JV'!H75,6))","v":""},{"$f":"IF('PJ-JV'!D75=0,\"\",LEFT('PJ-JV'!I75,24))","v":""},{"$f":"IF('PJ-JV'!D75=0,\"\",LEFT('PJ-JV'!J75,18))","v":""},{"$f":"IF('PJ-JV'!D75=0,\"\",LEFT('PJ-JV'!K75,50))","v":""},{"$f":"IF('PJ-JV'!D75=0,\"\",LEFT('PJ-JV'!L75,8))","v":""},{"$f":"IF('PJ-JV'!D75=0,\"\",LEFT('PJ-JV'!M75,10))","v":""},{"$f":"IF('PJ-JV'!D75=0,\"\",LEFT('PJ-JV'!N75,3))","v":""},{"$f":"IF('PJ-JV'!D75=0,\"\",LEFT('PJ-JV'!O75,6))","v":""},{"$f":"IF('PJ-JV'!D75=0,\"\",LEFT('PJ-JV'!P75,4))","v":""},{"$f":"IF('PJ-JV'!D75=0,\"\",LEFT('PJ-JV'!Q75,5))","v":""},{"$f":"IF('PJ-JV'!D75=0,\"\",LEFT('PJ-JV'!R75,4))","v":""},{"$f":"IF('PJ-JV'!D75=0,\"\",LEFT('PJ-JV'!S75,12))","v":""},{"$f":"IF('PJ-JV'!D75=0,\"\",LEFT('PJ-JV'!T75,12))","v":""},{"$f":"IF('PJ-JV'!D75=0,\"\",LEFT('PJ-JV'!U75,20))","v":""}]
[{"$f":"IF('PJ-JV'!D76=0,\"\",\"IT\")","v":""},null,{"$f":"IF('PJ-JV'!D76=0,\"\",'PJ-JV'!B76)","v":""},null,null,null,null,null,null,null,null,{"$f":"IF('PJ-JV'!D76=0,\"\",LEFT('PJ-JV'!C76,6))","v":""},{"$f":"IF('PJ-JV'!D76=0,\"\",ROUND('PJ-JV'!D76,2))","v":""},{"$f":"IF('PJ-JV'!D76=0,\"\",LEFT('PJ-JV'!E76,6))","v":""},{"$f":"IF('PJ-JV'!D76=0,\"\",PROPER(LEFT('PJ-JV'!F76,4)))","v":""},{"$f":"IF('PJ-JV'!D76=0,\"\",LEFT('PJ-JV'!G76,9))","v":""},{"$f":"IF('PJ-JV'!D76=0,\"\",LEFT('PJ-JV'!H76,6))","v":""},{"$f":"IF('PJ-JV'!D76=0,\"\",LEFT('PJ-JV'!I76,24))","v":""},{"$f":"IF('PJ-JV'!D76=0,\"\",LEFT('PJ-JV'!J76,18))","v":""},{"$f":"IF('PJ-JV'!D76=0,\"\",LEFT('PJ-JV'!K76,50))","v":""},{"$f":"IF('PJ-JV'!D76=0,\"\",LEFT('PJ-JV'!L76,8))","v":""},{"$f":"IF('PJ-JV'!D76=0,\"\",LEFT('PJ-JV'!M76,10))","v":""},{"$f":"IF('PJ-JV'!D76=0,\"\",LEFT('PJ-JV'!N76,3))","v":""},{"$f":"IF('PJ-JV'!D76=0,\"\",LEFT('PJ-JV'!O76,6))","v":""},{"$f":"IF('PJ-JV'!D76=0,\"\",LEFT('PJ-JV'!P76,4))","v":""},{"$f":"IF('PJ-JV'!D76=0,\"\",LEFT('PJ-JV'!Q76,5))","v":""},{"$f":"IF('PJ-JV'!D76=0,\"\",LEFT('PJ-JV'!R76,4))","v":""},{"$f":"IF('PJ-JV'!D76=0,\"\",LEFT('PJ-JV'!S76,12))","v":""},{"$f":"IF('PJ-JV'!D76=0,\"\",LEFT('PJ-JV'!T76,12))","v":""},{"$f":"IF('PJ-JV'!D76=0,\"\",LEFT('PJ-JV'!U76,20))","v":""}]
[{"$f":"IF('PJ-JV'!D77=0,\"\",\"IT\")","v":""},null,{"$f":"IF('PJ-JV'!D77=0,\"\",'PJ-JV'!B77)","v":""},null,null,null,null,null,null,null,null,{"$f":"IF('PJ-JV'!D77=0,\"\",LEFT('PJ-JV'!C77,6))","v":""},{"$f":"IF('PJ-JV'!D77=0,\"\",ROUND('PJ-JV'!D77,2))","v":""},{"$f":"IF('PJ-JV'!D77=0,\"\",LEFT('PJ-JV'!E77,6))","v":""},{"$f":"IF('PJ-JV'!D77=0,\"\",PROPER(LEFT('PJ-JV'!F77,4)))","v":""},{"$f":"IF('PJ-JV'!D77=0,\"\",LEFT('PJ-JV'!G77,9))","v":""},{"$f":"IF('PJ-JV'!D77=0,\"\",LEFT('PJ-JV'!H77,6))","v":""},{"$f":"IF('PJ-JV'!D77=0,\"\",LEFT('PJ-JV'!I77,24))","v":""},{"$f":"IF('PJ-JV'!D77=0,\"\",LEFT('PJ-JV'!J77,18))","v":""},{"$f":"IF('PJ-JV'!D77=0,\"\",LEFT('PJ-JV'!K77,50))","v":""},{"$f":"IF('PJ-JV'!D77=0,\"\",LEFT('PJ-JV'!L77,8))","v":""},{"$f":"IF('PJ-JV'!D77=0,\"\",LEFT('PJ-JV'!M77,10))","v":""},{"$f":"IF('PJ-JV'!D77=0,\"\",LEFT('PJ-JV'!N77,3))","v":""},{"$f":"IF('PJ-JV'!D77=0,\"\",LEFT('PJ-JV'!O77,6))","v":""},{"$f":"IF('PJ-JV'!D77=0,\"\",LEFT('PJ-JV'!P77,4))","v":""},{"$f":"IF('PJ-JV'!D77=0,\"\",LEFT('PJ-JV'!Q77,5))","v":""},{"$f":"IF('PJ-JV'!D77=0,\"\",LEFT('PJ-JV'!R77,4))","v":""},{"$f":"IF('PJ-JV'!D77=0,\"\",LEFT('PJ-JV'!S77,12))","v":""},{"$f":"IF('PJ-JV'!D77=0,\"\",LEFT('PJ-JV'!T77,12))","v":""},{"$f":"IF('PJ-JV'!D77=0,\"\",LEFT('PJ-JV'!U77,20))","v":""}]
[{"$f":"IF('PJ-JV'!D78=0,\"\",\"IT\")","v":""},null,{"$f":"IF('PJ-JV'!D78=0,\"\",'PJ-JV'!B78)","v":""},null,null,null,null,null,null,null,null,{"$f":"IF('PJ-JV'!D78=0,\"\",LEFT('PJ-JV'!C78,6))","v":""},{"$f":"IF('PJ-JV'!D78=0,\"\",ROUND('PJ-JV'!D78,2))","v":""},{"$f":"IF('PJ-JV'!D78=0,\"\",LEFT('PJ-JV'!E78,6))","v":""},{"$f":"IF('PJ-JV'!D78=0,\"\",PROPER(LEFT('PJ-JV'!F78,4)))","v":""},{"$f":"IF('PJ-JV'!D78=0,\"\",LEFT('PJ-JV'!G78,9))","v":""},{"$f":"IF('PJ-JV'!D78=0,\"\",LEFT('PJ-JV'!H78,6))","v":""},{"$f":"IF('PJ-JV'!D78=0,\"\",LEFT('PJ-JV'!I78,24))","v":""},{"$f":"IF('PJ-JV'!D78=0,\"\",LEFT('PJ-JV'!J78,18))","v":""},{"$f":"IF('PJ-JV'!D78=0,\"\",LEFT('PJ-JV'!K78,50))","v":""},{"$f":"IF('PJ-JV'!D78=0,\"\",LEFT('PJ-JV'!L78,8))","v":""},{"$f":"IF('PJ-JV'!D78=0,\"\",LEFT('PJ-JV'!M78,10))","v":""},{"$f":"IF('PJ-JV'!D78=0,\"\",LEFT('PJ-JV'!N78,3))","v":""},{"$f":"IF('PJ-JV'!D78=0,\"\",LEFT('PJ-JV'!O78,6))","v":""},{"$f":"IF('PJ-JV'!D78=0,\"\",LEFT('PJ-JV'!P78,4))","v":""},{"$f":"IF('PJ-JV'!D78=0,\"\",LEFT('PJ-JV'!Q78,5))","v":""},{"$f":"IF('PJ-JV'!D78=0,\"\",LEFT('PJ-JV'!R78,4))","v":""},{"$f":"IF('PJ-JV'!D78=0,\"\",LEFT('PJ-JV'!S78,12))","v":""},{"$f":"IF('PJ-JV'!D78=0,\"\",LEFT('PJ-JV'!T78,12))","v":""},{"$f":"IF('PJ-JV'!D78=0,\"\",LEFT('PJ-JV'!U78,20))","v":""}]
[{"$f":"IF('PJ-JV'!D79=0,\"\",\"IT\")","v":""},null,{"$f":"IF('PJ-JV'!D79=0,\"\",'PJ-JV'!B79)","v":""},null,null,null,null,null,null,null,null,{"$f":"IF('PJ-JV'!D79=0,\"\",LEFT('PJ-JV'!C79,6))","v":""},{"$f":"IF('PJ-JV'!D79=0,\"\",ROUND('PJ-JV'!D79,2))","v":""},{"$f":"IF('PJ-JV'!D79=0,\"\",LEFT('PJ-JV'!E79,6))","v":""},{"$f":"IF('PJ-JV'!D79=0,\"\",PROPER(LEFT('PJ-JV'!F79,4)))","v":""},{"$f":"IF('PJ-JV'!D79=0,\"\",LEFT('PJ-JV'!G79,9))","v":""},{"$f":"IF('PJ-JV'!D79=0,\"\",LEFT('PJ-JV'!H79,6))","v":""},{"$f":"IF('PJ-JV'!D79=0,\"\",LEFT('PJ-JV'!I79,24))","v":""},{"$f":"IF('PJ-JV'!D79=0,\"\",LEFT('PJ-JV'!J79,18))","v":""},{"$f":"IF('PJ-JV'!D79=0,\"\",LEFT('PJ-JV'!K79,50))","v":""},{"$f":"IF('PJ-JV'!D79=0,\"\",LEFT('PJ-JV'!L79,8))","v":""},{"$f":"IF('PJ-JV'!D79=0,\"\",LEFT('PJ-JV'!M79,10))","v":""},{"$f":"IF('PJ-JV'!D79=0,\"\",LEFT('PJ-JV'!N79,3))","v":""},{"$f":"IF('PJ-JV'!D79=0,\"\",LEFT('PJ-JV'!O79,6))","v":""},{"$f":"IF('PJ-JV'!D79=0,\"\",LEFT('PJ-JV'!P79,4))","v":""},{"$f":"IF('PJ-JV'!D79=0,\"\",LEFT('PJ-JV'!Q79,5))","v":""},{"$f":"IF('PJ-JV'!D79=0,\"\",LEFT('PJ-JV'!R79,4))","v":""},{"$f":"IF('PJ-JV'!D79=0,\"\",LEFT('PJ-JV'!S79,12))","v":""},{"$f":"IF('PJ-JV'!D79=0,\"\",LEFT('PJ-JV'!T79,12))","v":""},{"$f":"IF('PJ-JV'!D79=0,\"\",LEFT('PJ-JV'!U79,20))","v":""}]
[{"$f":"IF('PJ-JV'!D80=0,\"\",\"IT\")","v":""},null,{"$f":"IF('PJ-JV'!D80=0,\"\",'PJ-JV'!B80)","v":""},null,null,null,null,null,null,null,null,{"$f":"IF('PJ-JV'!D80=0,\"\",LEFT('PJ-JV'!C80,6))","v":""},{"$f":"IF('PJ-JV'!D80=0,\"\",ROUND('PJ-JV'!D80,2))","v":""},{"$f":"IF('PJ-JV'!D80=0,\"\",LEFT('PJ-JV'!E80,6))","v":""},{"$f":"IF('PJ-JV'!D80=0,\"\",PROPER(LEFT('PJ-JV'!F80,4)))","v":""},{"$f":"IF('PJ-JV'!D80=0,\"\",LEFT('PJ-JV'!G80,9))","v":""},{"$f":"IF('PJ-JV'!D80=0,\"\",LEFT('PJ-JV'!H80,6))","v":""},{"$f":"IF('PJ-JV'!D80=0,\"\",LEFT('PJ-JV'!I80,24))","v":""},{"$f":"IF('PJ-JV'!D80=0,\"\",LEFT('PJ-JV'!J80,18))","v":""},{"$f":"IF('PJ-JV'!D80=0,\"\",LEFT('PJ-JV'!K80,50))","v":""},{"$f":"IF('PJ-JV'!D80=0,\"\",LEFT('PJ-JV'!L80,8))","v":""},{"$f":"IF('PJ-JV'!D80=0,\"\",LEFT('PJ-JV'!M80,10))","v":""},{"$f":"IF('PJ-JV'!D80=0,\"\",LEFT('PJ-JV'!N80,3))","v":""},{"$f":"IF('PJ-JV'!D80=0,\"\",LEFT('PJ-JV'!O80,6))","v":""},{"$f":"IF('PJ-JV'!D80=0,\"\",LEFT('PJ-JV'!P80,4))","v":""},{"$f":"IF('PJ-JV'!D80=0,\"\",LEFT('PJ-JV'!Q80,5))","v":""},{"$f":"IF('PJ-JV'!D80=0,\"\",LEFT('PJ-JV'!R80,4))","v":""},{"$f":"IF('PJ-JV'!D80=0,\"\",LEFT('PJ-JV'!S80,12))","v":""},{"$f":"IF('PJ-JV'!D80=0,\"\",LEFT('PJ-JV'!T80,12))","v":""},{"$f":"IF('PJ-JV'!D80=0,\"\",LEFT('PJ-JV'!U80,20))","v":""}]
[{"$f":"IF('PJ-JV'!D81=0,\"\",\"IT\")","v":""},null,{"$f":"IF('PJ-JV'!D81=0,\"\",'PJ-JV'!B81)","v":""},null,null,null,null,null,null,null,null,{"$f":"IF('PJ-JV'!D81=0,\"\",LEFT('PJ-JV'!C81,6))","v":""},{"$f":"IF('PJ-JV'!D81=0,\"\",ROUND('PJ-JV'!D81,2))","v":""},{"$f":"IF('PJ-JV'!D81=0,\"\",LEFT('PJ-JV'!E81,6))","v":""},{"$f":"IF('PJ-JV'!D81=0,\"\",PROPER(LEFT('PJ-JV'!F81,4)))","v":""},{"$f":"IF('PJ-JV'!D81=0,\"\",LEFT('PJ-JV'!G81,9))","v":""},{"$f":"IF('PJ-JV'!D81=0,\"\",LEFT('PJ-JV'!H81,6))","v":""},{"$f":"IF('PJ-JV'!D81=0,\"\",LEFT('PJ-JV'!I81,24))","v":""},{"$f":"IF('PJ-JV'!D81=0,\"\",LEFT('PJ-JV'!J81,18))","v":""},{"$f":"IF('PJ-JV'!D81=0,\"\",LEFT('PJ-JV'!K81,50))","v":""},{"$f":"IF('PJ-JV'!D81=0,\"\",LEFT('PJ-JV'!L81,8))","v":""},{"$f":"IF('PJ-JV'!D81=0,\"\",LEFT('PJ-JV'!M81,10))","v":""},{"$f":"IF('PJ-JV'!D81=0,\"\",LEFT('PJ-JV'!N81,3))","v":""},{"$f":"IF('PJ-JV'!D81=0,\"\",LEFT('PJ-JV'!O81,6))","v":""},{"$f":"IF('PJ-JV'!D81=0,\"\",LEFT('PJ-JV'!P81,4))","v":""},{"$f":"IF('PJ-JV'!D81=0,\"\",LEFT('PJ-JV'!Q81,5))","v":""},{"$f":"IF('PJ-JV'!D81=0,\"\",LEFT('PJ-JV'!R81,4))","v":""},{"$f":"IF('PJ-JV'!D81=0,\"\",LEFT('PJ-JV'!S81,12))","v":""},{"$f":"IF('PJ-JV'!D81=0,\"\",LEFT('PJ-JV'!T81,12))","v":""},{"$f":"IF('PJ-JV'!D81=0,\"\",LEFT('PJ-JV'!U81,20))","v":""}]
[{"$f":"IF('PJ-JV'!D82=0,\"\",\"IT\")","v":""},null,{"$f":"IF('PJ-JV'!D82=0,\"\",'PJ-JV'!B82)","v":""},null,null,null,null,null,null,null,null,{"$f":"IF('PJ-JV'!D82=0,\"\",LEFT('PJ-JV'!C82,6))","v":""},{"$f":"IF('PJ-JV'!D82=0,\"\",ROUND('PJ-JV'!D82,2))","v":""},{"$f":"IF('PJ-JV'!D82=0,\"\",LEFT('PJ-JV'!E82,6))","v":""},{"$f":"IF('PJ-JV'!D82=0,\"\",PROPER(LEFT('PJ-JV'!F82,4)))","v":""},{"$f":"IF('PJ-JV'!D82=0,\"\",LEFT('PJ-JV'!G82,9))","v":""},{"$f":"IF('PJ-JV'!D82=0,\"\",LEFT('PJ-JV'!H82,6))","v":""},{"$f":"IF('PJ-JV'!D82=0,\"\",LEFT('PJ-JV'!I82,24))","v":""},{"$f":"IF('PJ-JV'!D82=0,\"\",LEFT('PJ-JV'!J82,18))","v":""},{"$f":"IF('PJ-JV'!D82=0,\"\",LEFT('PJ-JV'!K82,50))","v":""},{"$f":"IF('PJ-JV'!D82=0,\"\",LEFT('PJ-JV'!L82,8))","v":""},{"$f":"IF('PJ-JV'!D82=0,\"\",LEFT('PJ-JV'!M82,10))","v":""},{"$f":"IF('PJ-JV'!D82=0,\"\",LEFT('PJ-JV'!N82,3))","v":""},{"$f":"IF('PJ-JV'!D82=0,\"\",LEFT('PJ-JV'!O82,6))","v":""},{"$f":"IF('PJ-JV'!D82=0,\"\",LEFT('PJ-JV'!P82,4))","v":""},{"$f":"IF('PJ-JV'!D82=0,\"\",LEFT('PJ-JV'!Q82,5))","v":""},{"$f":"IF('PJ-JV'!D82=0,\"\",LEFT('PJ-JV'!R82,4))","v":""},{"$f":"IF('PJ-JV'!D82=0,\"\",LEFT('PJ-JV'!S82,12))","v":""},{"$f":"IF('PJ-JV'!D82=0,\"\",LEFT('PJ-JV'!T82,12))","v":""},{"$f":"IF('PJ-JV'!D82=0,\"\",LEFT('PJ-JV'!U82,20))","v":""}]
[{"$f":"IF('PJ-JV'!D83=0,\"\",\"IT\")","v":""},null,{"$f":"IF('PJ-JV'!D83=0,\"\",'PJ-JV'!B83)","v":""},null,null,null,null,null,null,null,null,{"$f":"IF('PJ-JV'!D83=0,\"\",LEFT('PJ-JV'!C83,6))","v":""},{"$f":"IF('PJ-JV'!D83=0,\"\",ROUND('PJ-JV'!D83,2))","v":""},{"$f":"IF('PJ-JV'!D83=0,\"\",LEFT('PJ-JV'!E83,6))","v":""},{"$f":"IF('PJ-JV'!D83=0,\"\",PROPER(LEFT('PJ-JV'!F83,4)))","v":""},{"$f":"IF('PJ-JV'!D83=0,\"\",LEFT('PJ-JV'!G83,9))","v":""},{"$f":"IF('PJ-JV'!D83=0,\"\",LEFT('PJ-JV'!H83,6))","v":""},{"$f":"IF('PJ-JV'!D83=0,\"\",LEFT('PJ-JV'!I83,24))","v":""},{"$f":"IF('PJ-JV'!D83=0,\"\",LEFT('PJ-JV'!J83,18))","v":""},{"$f":"IF('PJ-JV'!D83=0,\"\",LEFT('PJ-JV'!K83,50))","v":""},{"$f":"IF('PJ-JV'!D83=0,\"\",LEFT('PJ-JV'!L83,8))","v":""},{"$f":"IF('PJ-JV'!D83=0,\"\",LEFT('PJ-JV'!M83,10))","v":""},{"$f":"IF('PJ-JV'!D83=0,\"\",LEFT('PJ-JV'!N83,3))","v":""},{"$f":"IF('PJ-JV'!D83=0,\"\",LEFT('PJ-JV'!O83,6))","v":""},{"$f":"IF('PJ-JV'!D83=0,\"\",LEFT('PJ-JV'!P83,4))","v":""},{"$f":"IF('PJ-JV'!D83=0,\"\",LEFT('PJ-JV'!Q83,5))","v":""},{"$f":"IF('PJ-JV'!D83=0,\"\",LEFT('PJ-JV'!R83,4))","v":""},{"$f":"IF('PJ-JV'!D83=0,\"\",LEFT('PJ-JV'!S83,12))","v":""},{"$f":"IF('PJ-JV'!D83=0,\"\",LEFT('PJ-JV'!T83,12))","v":""},{"$f":"IF('PJ-JV'!D83=0,\"\",LEFT('PJ-JV'!U83,20))","v":""}]
[{"$f":"IF('PJ-JV'!D84=0,\"\",\"IT\")","v":""},null,{"$f":"IF('PJ-JV'!D84=0,\"\",'PJ-JV'!B84)","v":""},null,null,null,null,null,null,null,null,{"$f":"IF('PJ-JV'!D84=0,\"\",LEFT('PJ-JV'!C84,6))","v":""},{"$f":"IF('PJ-JV'!D84=0,\"\",ROUND('PJ-JV'!D84,2))","v":""},{"$f":"IF('PJ-JV'!D84=0,\"\",LEFT('PJ-JV'!E84,6))","v":""},{"$f":"IF('PJ-JV'!D84=0,\"\",PROPER(LEFT('PJ-JV'!F84,4)))","v":""},{"$f":"IF('PJ-JV'!D84=0,\"\",LEFT('PJ-JV'!G84,9))","v":""},{"$f":"IF('PJ-JV'!D84=0,\"\",LEFT('PJ-JV'!H84,6))","v":""},{"$f":"IF('PJ-JV'!D84=0,\"\",LEFT('PJ-JV'!I84,24))","v":""},{"$f":"IF('PJ-JV'!D84=0,\"\",LEFT('PJ-JV'!J84,18))","v":""},{"$f":"IF('PJ-JV'!D84=0,\"\",LEFT('PJ-JV'!K84,50))","v":""},{"$f":"IF('PJ-JV'!D84=0,\"\",LEFT('PJ-JV'!L84,8))","v":""},{"$f":"IF('PJ-JV'!D84=0,\"\",LEFT('PJ-JV'!M84,10))","v":""},{"$f":"IF('PJ-JV'!D84=0,\"\",LEFT('PJ-JV'!N84,3))","v":""},{"$f":"IF('PJ-JV'!D84=0,\"\",LEFT('PJ-JV'!O84,6))","v":""},{"$f":"IF('PJ-JV'!D84=0,\"\",LEFT('PJ-JV'!P84,4))","v":""},{"$f":"IF('PJ-JV'!D84=0,\"\",LEFT('PJ-JV'!Q84,5))","v":""},{"$f":"IF('PJ-JV'!D84=0,\"\",LEFT('PJ-JV'!R84,4))","v":""},{"$f":"IF('PJ-JV'!D84=0,\"\",LEFT('PJ-JV'!S84,12))","v":""},{"$f":"IF('PJ-JV'!D84=0,\"\",LEFT('PJ-JV'!T84,12))","v":""},{"$f":"IF('PJ-JV'!D84=0,\"\",LEFT('PJ-JV'!U84,20))","v":""}]
[{"$f":"IF('PJ-JV'!D85=0,\"\",\"IT\")","v":""},null,{"$f":"IF('PJ-JV'!D85=0,\"\",'PJ-JV'!B85)","v":""},null,null,null,null,null,null,null,null,{"$f":"IF('PJ-JV'!D85=0,\"\",LEFT('PJ-JV'!C85,6))","v":""},{"$f":"IF('PJ-JV'!D85=0,\"\",ROUND('PJ-JV'!D85,2))","v":""},{"$f":"IF('PJ-JV'!D85=0,\"\",LEFT('PJ-JV'!E85,6))","v":""},{"$f":"IF('PJ-JV'!D85=0,\"\",PROPER(LEFT('PJ-JV'!F85,4)))","v":""},{"$f":"IF('PJ-JV'!D85=0,\"\",LEFT('PJ-JV'!G85,9))","v":""},{"$f":"IF('PJ-JV'!D85=0,\"\",LEFT('PJ-JV'!H85,6))","v":""},{"$f":"IF('PJ-JV'!D85=0,\"\",LEFT('PJ-JV'!I85,24))","v":""},{"$f":"IF('PJ-JV'!D85=0,\"\",LEFT('PJ-JV'!J85,18))","v":""},{"$f":"IF('PJ-JV'!D85=0,\"\",LEFT('PJ-JV'!K85,50))","v":""},{"$f":"IF('PJ-JV'!D85=0,\"\",LEFT('PJ-JV'!L85,8))","v":""},{"$f":"IF('PJ-JV'!D85=0,\"\",LEFT('PJ-JV'!M85,10))","v":""},{"$f":"IF('PJ-JV'!D85=0,\"\",LEFT('PJ-JV'!N85,3))","v":""},{"$f":"IF('PJ-JV'!D85=0,\"\",LEFT('PJ-JV'!O85,6))","v":""},{"$f":"IF('PJ-JV'!D85=0,\"\",LEFT('PJ-JV'!P85,4))","v":""},{"$f":"IF('PJ-JV'!D85=0,\"\",LEFT('PJ-JV'!Q85,5))","v":""},{"$f":"IF('PJ-JV'!D85=0,\"\",LEFT('PJ-JV'!R85,4))","v":""},{"$f":"IF('PJ-JV'!D85=0,\"\",LEFT('PJ-JV'!S85,12))","v":""},{"$f":"IF('PJ-JV'!D85=0,\"\",LEFT('PJ-JV'!T85,12))","v":""},{"$f":"IF('PJ-JV'!D85=0,\"\",LEFT('PJ-JV'!U85,20))","v":""}]
[{"$f":"IF('PJ-JV'!D86=0,\"\",\"IT\")","v":""},null,{"$f":"IF('PJ-JV'!D86=0,\"\",'PJ-JV'!B86)","v":""},null,null,null,null,null,null,null,null,{"$f":"IF('PJ-JV'!D86=0,\"\",LEFT('PJ-JV'!C86,6))","v":""},{"$f":"IF('PJ-JV'!D86=0,\"\",ROUND('PJ-JV'!D86,2))","v":""},{"$f":"IF('PJ-JV'!D86=0,\"\",LEFT('PJ-JV'!E86,6))","v":""},{"$f":"IF('PJ-JV'!D86=0,\"\",PROPER(LEFT('PJ-JV'!F86,4)))","v":""},{"$f":"IF('PJ-JV'!D86=0,\"\",LEFT('PJ-JV'!G86,9))","v":""},{"$f":"IF('PJ-JV'!D86=0,\"\",LEFT('PJ-JV'!H86,6))","v":""},{"$f":"IF('PJ-JV'!D86=0,\"\",LEFT('PJ-JV'!I86,24))","v":""},{"$f":"IF('PJ-JV'!D86=0,\"\",LEFT('PJ-JV'!J86,18))","v":""},{"$f":"IF('PJ-JV'!D86=0,\"\",LEFT('PJ-JV'!K86,50))","v":""},{"$f":"IF('PJ-JV'!D86=0,\"\",LEFT('PJ-JV'!L86,8))","v":""},{"$f":"IF('PJ-JV'!D86=0,\"\",LEFT('PJ-JV'!M86,10))","v":""},{"$f":"IF('PJ-JV'!D86=0,\"\",LEFT('PJ-JV'!N86,3))","v":""},{"$f":"IF('PJ-JV'!D86=0,\"\",LEFT('PJ-JV'!O86,6))","v":""},{"$f":"IF('PJ-JV'!D86=0,\"\",LEFT('PJ-JV'!P86,4))","v":""},{"$f":"IF('PJ-JV'!D86=0,\"\",LEFT('PJ-JV'!Q86,5))","v":""},{"$f":"IF('PJ-JV'!D86=0,\"\",LEFT('PJ-JV'!R86,4))","v":""},{"$f":"IF('PJ-JV'!D86=0,\"\",LEFT('PJ-JV'!S86,12))","v":""},{"$f":"IF('PJ-JV'!D86=0,\"\",LEFT('PJ-JV'!T86,12))","v":""},{"$f":"IF('PJ-JV'!D86=0,\"\",LEFT('PJ-JV'!U86,20))","v":""}]
[{"$f":"IF('PJ-JV'!D87=0,\"\",\"IT\")","v":""},null,{"$f":"IF('PJ-JV'!D87=0,\"\",'PJ-JV'!B87)","v":""},null,null,null,null,null,null,null,null,{"$f":"IF('PJ-JV'!D87=0,\"\",LEFT('PJ-JV'!C87,6))","v":""},{"$f":"IF('PJ-JV'!D87=0,\"\",ROUND('PJ-JV'!D87,2))","v":""},{"$f":"IF('PJ-JV'!D87=0,\"\",LEFT('PJ-JV'!E87,6))","v":""},{"$f":"IF('PJ-JV'!D87=0,\"\",PROPER(LEFT('PJ-JV'!F87,4)))","v":""},{"$f":"IF('PJ-JV'!D87=0,\"\",LEFT('PJ-JV'!G87,9))","v":""},{"$f":"IF('PJ-JV'!D87=0,\"\",LEFT('PJ-JV'!H87,6))","v":""},{"$f":"IF('PJ-JV'!D87=0,\"\",LEFT('PJ-JV'!I87,24))","v":""},{"$f":"IF('PJ-JV'!D87=0,\"\",LEFT('PJ-JV'!J87,18))","v":""},{"$f":"IF('PJ-JV'!D87=0,\"\",LEFT('PJ-JV'!K87,50))","v":""},{"$f":"IF('PJ-JV'!D87=0,\"\",LEFT('PJ-JV'!L87,8))","v":""},{"$f":"IF('PJ-JV'!D87=0,\"\",LEFT('PJ-JV'!M87,10))","v":""},{"$f":"IF('PJ-JV'!D87=0,\"\",LEFT('PJ-JV'!N87,3))","v":""},{"$f":"IF('PJ-JV'!D87=0,\"\",LEFT('PJ-JV'!O87,6))","v":""},{"$f":"IF('PJ-JV'!D87=0,\"\",LEFT('PJ-JV'!P87,4))","v":""},{"$f":"IF('PJ-JV'!D87=0,\"\",LEFT('PJ-JV'!Q87,5))","v":""},{"$f":"IF('PJ-JV'!D87=0,\"\",LEFT('PJ-JV'!R87,4))","v":""},{"$f":"IF('PJ-JV'!D87=0,\"\",LEFT('PJ-JV'!S87,12))","v":""},{"$f":"IF('PJ-JV'!D87=0,\"\",LEFT('PJ-JV'!T87,12))","v":""},{"$f":"IF('PJ-JV'!D87=0,\"\",LEFT('PJ-JV'!U87,20))","v":""}]
[{"$f":"IF('PJ-JV'!D88=0,\"\",\"IT\")","v":""},null,{"$f":"IF('PJ-JV'!D88=0,\"\",'PJ-JV'!B88)","v":""},null,null,null,null,null,null,null,null,{"$f":"IF('PJ-JV'!D88=0,\"\",LEFT('PJ-JV'!C88,6))","v":""},{"$f":"IF('PJ-JV'!D88=0,\"\",ROUND('PJ-JV'!D88,2))","v":""},{"$f":"IF('PJ-JV'!D88=0,\"\",LEFT('PJ-JV'!E88,6))","v":""},{"$f":"IF('PJ-JV'!D88=0,\"\",PROPER(LEFT('PJ-JV'!F88,4)))","v":""},{"$f":"IF('PJ-JV'!D88=0,\"\",LEFT('PJ-JV'!G88,9))","v":""},{"$f":"IF('PJ-JV'!D88=0,\"\",LEFT('PJ-JV'!H88,6))","v":""},{"$f":"IF('PJ-JV'!D88=0,\"\",LEFT('PJ-JV'!I88,24))","v":""},{"$f":"IF('PJ-JV'!D88=0,\"\",LEFT('PJ-JV'!J88,18))","v":""},{"$f":"IF('PJ-JV'!D88=0,\"\",LEFT('PJ-JV'!K88,50))","v":""},{"$f":"IF('PJ-JV'!D88=0,\"\",LEFT('PJ-JV'!L88,8))","v":""},{"$f":"IF('PJ-JV'!D88=0,\"\",LEFT('PJ-JV'!M88,10))","v":""},{"$f":"IF('PJ-JV'!D88=0,\"\",LEFT('PJ-JV'!N88,3))","v":""},{"$f":"IF('PJ-JV'!D88=0,\"\",LEFT('PJ-JV'!O88,6))","v":""},{"$f":"IF('PJ-JV'!D88=0,\"\",LEFT('PJ-JV'!P88,4))","v":""},{"$f":"IF('PJ-JV'!D88=0,\"\",LEFT('PJ-JV'!Q88,5))","v":""},{"$f":"IF('PJ-JV'!D88=0,\"\",LEFT('PJ-JV'!R88,4))","v":""},{"$f":"IF('PJ-JV'!D88=0,\"\",LEFT('PJ-JV'!S88,12))","v":""},{"$f":"IF('PJ-JV'!D88=0,\"\",LEFT('PJ-JV'!T88,12))","v":""},{"$f":"IF('PJ-JV'!D88=0,\"\",LEFT('PJ-JV'!U88,20))","v":""}]
[{"$f":"IF('PJ-JV'!D89=0,\"\",\"IT\")","v":""},null,{"$f":"IF('PJ-JV'!D89=0,\"\",'PJ-JV'!B89)","v":""},null,null,null,null,null,null,null,null,{"$f":"IF('PJ-JV'!D89=0,\"\",LEFT('PJ-JV'!C89,6))","v":""},{"$f":"IF('PJ-JV'!D89=0,\"\",ROUND('PJ-JV'!D89,2))","v":""},{"$f":"IF('PJ-JV'!D89=0,\"\",LEFT('PJ-JV'!E89,6))","v":""},{"$f":"IF('PJ-JV'!D89=0,\"\",PROPER(LEFT('PJ-JV'!F89,4)))","v":""},{"$f":"IF('PJ-JV'!D89=0,\"\",LEFT('PJ-JV'!G89,9))","v":""},{"$f":"IF('PJ-JV'!D89=0,\"\",LEFT('PJ-JV'!H89,6))","v":""},{"$f":"IF('PJ-JV'!D89=0,\"\",LEFT('PJ-JV'!I89,24))","v":""},{"$f":"IF('PJ-JV'!D89=0,\"\",LEFT('PJ-JV'!J89,18))","v":""},{"$f":"IF('PJ-JV'!D89=0,\"\",LEFT('PJ-JV'!K89,50))","v":""},{"$f":"IF('PJ-JV'!D89=0,\"\",LEFT('PJ-JV'!L89,8))","v":""},{"$f":"IF('PJ-JV'!D89=0,\"\",LEFT('PJ-JV'!M89,10))","v":""},{"$f":"IF('PJ-JV'!D89=0,\"\",LEFT('PJ-JV'!N89,3))","v":""},{"$f":"IF('PJ-JV'!D89=0,\"\",LEFT('PJ-JV'!O89,6))","v":""},{"$f":"IF('PJ-JV'!D89=0,\"\",LEFT('PJ-JV'!P89,4))","v":""},{"$f":"IF('PJ-JV'!D89=0,\"\",LEFT('PJ-JV'!Q89,5))","v":""},{"$f":"IF('PJ-JV'!D89=0,\"\",LEFT('PJ-JV'!R89,4))","v":""},{"$f":"IF('PJ-JV'!D89=0,\"\",LEFT('PJ-JV'!S89,12))","v":""},{"$f":"IF('PJ-JV'!D89=0,\"\",LEFT('PJ-JV'!T89,12))","v":""},{"$f":"IF('PJ-JV'!D89=0,\"\",LEFT('PJ-JV'!U89,20))","v":""}]
[{"$f":"IF('PJ-JV'!D90=0,\"\",\"IT\")","v":""},null,{"$f":"IF('PJ-JV'!D90=0,\"\",'PJ-JV'!B90)","v":""},null,null,null,null,null,null,null,null,{"$f":"IF('PJ-JV'!D90=0,\"\",LEFT('PJ-JV'!C90,6))","v":""},{"$f":"IF('PJ-JV'!D90=0,\"\",ROUND('PJ-JV'!D90,2))","v":""},{"$f":"IF('PJ-JV'!D90=0,\"\",LEFT('PJ-JV'!E90,6))","v":""},{"$f":"IF('PJ-JV'!D90=0,\"\",PROPER(LEFT('PJ-JV'!F90,4)))","v":""},{"$f":"IF('PJ-JV'!D90=0,\"\",LEFT('PJ-JV'!G90,9))","v":""},{"$f":"IF('PJ-JV'!D90=0,\"\",LEFT('PJ-JV'!H90,6))","v":""},{"$f":"IF('PJ-JV'!D90=0,\"\",LEFT('PJ-JV'!I90,24))","v":""},{"$f":"IF('PJ-JV'!D90=0,\"\",LEFT('PJ-JV'!J90,18))","v":""},{"$f":"IF('PJ-JV'!D90=0,\"\",LEFT('PJ-JV'!K90,50))","v":""},{"$f":"IF('PJ-JV'!D90=0,\"\",LEFT('PJ-JV'!L90,8))","v":""},{"$f":"IF('PJ-JV'!D90=0,\"\",LEFT('PJ-JV'!M90,10))","v":""},{"$f":"IF('PJ-JV'!D90=0,\"\",LEFT('PJ-JV'!N90,3))","v":""},{"$f":"IF('PJ-JV'!D90=0,\"\",LEFT('PJ-JV'!O90,6))","v":""},{"$f":"IF('PJ-JV'!D90=0,\"\",LEFT('PJ-JV'!P90,4))","v":""},{"$f":"IF('PJ-JV'!D90=0,\"\",LEFT('PJ-JV'!Q90,5))","v":""},{"$f":"IF('PJ-JV'!D90=0,\"\",LEFT('PJ-JV'!R90,4))","v":""},{"$f":"IF('PJ-JV'!D90=0,\"\",LEFT('PJ-JV'!S90,12))","v":""},{"$f":"IF('PJ-JV'!D90=0,\"\",LEFT('PJ-JV'!T90,12))","v":""},{"$f":"IF('PJ-JV'!D90=0,\"\",LEFT('PJ-JV'!U90,20))","v":""}]
[{"$f":"IF('PJ-JV'!D91=0,\"\",\"IT\")","v":""},null,{"$f":"IF('PJ-JV'!D91=0,\"\",'PJ-JV'!B91)","v":""},null,null,null,null,null,null,null,null,{"$f":"IF('PJ-JV'!D91=0,\"\",LEFT('PJ-JV'!C91,6))","v":""},{"$f":"IF('PJ-JV'!D91=0,\"\",ROUND('PJ-JV'!D91,2))","v":""},{"$f":"IF('PJ-JV'!D91=0,\"\",LEFT('PJ-JV'!E91,6))","v":""},{"$f":"IF('PJ-JV'!D91=0,\"\",PROPER(LEFT('PJ-JV'!F91,4)))","v":""},{"$f":"IF('PJ-JV'!D91=0,\"\",LEFT('PJ-JV'!G91,9))","v":""},{"$f":"IF('PJ-JV'!D91=0,\"\",LEFT('PJ-JV'!H91,6))","v":""},{"$f":"IF('PJ-JV'!D91=0,\"\",LEFT('PJ-JV'!I91,24))","v":""},{"$f":"IF('PJ-JV'!D91=0,\"\",LEFT('PJ-JV'!J91,18))","v":""},{"$f":"IF('PJ-JV'!D91=0,\"\",LEFT('PJ-JV'!K91,50))","v":""},{"$f":"IF('PJ-JV'!D91=0,\"\",LEFT('PJ-JV'!L91,8))","v":""},{"$f":"IF('PJ-JV'!D91=0,\"\",LEFT('PJ-JV'!M91,10))","v":""},{"$f":"IF('PJ-JV'!D91=0,\"\",LEFT('PJ-JV'!N91,3))","v":""},{"$f":"IF('PJ-JV'!D91=0,\"\",LEFT('PJ-JV'!O91,6))","v":""},{"$f":"IF('PJ-JV'!D91=0,\"\",LEFT('PJ-JV'!P91,4))","v":""},{"$f":"IF('PJ-JV'!D91=0,\"\",LEFT('PJ-JV'!Q91,5))","v":""},{"$f":"IF('PJ-JV'!D91=0,\"\",LEFT('PJ-JV'!R91,4))","v":""},{"$f":"IF('PJ-JV'!D91=0,\"\",LEFT('PJ-JV'!S91,12))","v":""},{"$f":"IF('PJ-JV'!D91=0,\"\",LEFT('PJ-JV'!T91,12))","v":""},{"$f":"IF('PJ-JV'!D91=0,\"\",LEFT('PJ-JV'!U91,20))","v":""}]
[{"$f":"IF('PJ-JV'!D92=0,\"\",\"IT\")","v":""},null,{"$f":"IF('PJ-JV'!D92=0,\"\",'PJ-JV'!B92)","v":""},null,null,null,null,null,null,null,null,{"$f":"IF('PJ-JV'!D92=0,\"\",LEFT('PJ-JV'!C92,6))","v":""},{"$f":"IF('PJ-JV'!D92=0,\"\",ROUND('PJ-JV'!D92,2))","v":""},{"$f":"IF('PJ-JV'!D92=0,\"\",LEFT('PJ-JV'!E92,6))","v":""},{"$f":"IF('PJ-JV'!D92=0,\"\",PROPER(LEFT('PJ-JV'!F92,4)))","v":""},{"$f":"IF('PJ-JV'!D92=0,\"\",LEFT('PJ-JV'!G92,9))","v":""},{"$f":"IF('PJ-JV'!D92=0,\"\",LEFT('PJ-JV'!H92,6))","v":""},{"$f":"IF('PJ-JV'!D92=0,\"\",LEFT('PJ-JV'!I92,24))","v":""},{"$f":"IF('PJ-JV'!D92=0,\"\",LEFT('PJ-JV'!J92,18))","v":""},{"$f":"IF('PJ-JV'!D92=0,\"\",LEFT('PJ-JV'!K92,50))","v":""},{"$f":"IF('PJ-JV'!D92=0,\"\",LEFT('PJ-JV'!L92,8))","v":""},{"$f":"IF('PJ-JV'!D92=0,\"\",LEFT('PJ-JV'!M92,10))","v":""},{"$f":"IF('PJ-JV'!D92=0,\"\",LEFT('PJ-JV'!N92,3))","v":""},{"$f":"IF('PJ-JV'!D92=0,\"\",LEFT('PJ-JV'!O92,6))","v":""},{"$f":"IF('PJ-JV'!D92=0,\"\",LEFT('PJ-JV'!P92,4))","v":""},{"$f":"IF('PJ-JV'!D92=0,\"\",LEFT('PJ-JV'!Q92,5))","v":""},{"$f":"IF('PJ-JV'!D92=0,\"\",LEFT('PJ-JV'!R92,4))","v":""},{"$f":"IF('PJ-JV'!D92=0,\"\",LEFT('PJ-JV'!S92,12))","v":""},{"$f":"IF('PJ-JV'!D92=0,\"\",LEFT('PJ-JV'!T92,12))","v":""},{"$f":"IF('PJ-JV'!D92=0,\"\",LEFT('PJ-JV'!U92,20))","v":""}]
[{"$f":"IF('PJ-JV'!D93=0,\"\",\"IT\")","v":""},null,{"$f":"IF('PJ-JV'!D93=0,\"\",'PJ-JV'!B93)","v":""},null,null,null,null,null,null,null,null,{"$f":"IF('PJ-JV'!D93=0,\"\",LEFT('PJ-JV'!C93,6))","v":""},{"$f":"IF('PJ-JV'!D93=0,\"\",ROUND('PJ-JV'!D93,2))","v":""},{"$f":"IF('PJ-JV'!D93=0,\"\",LEFT('PJ-JV'!E93,6))","v":""},{"$f":"IF('PJ-JV'!D93=0,\"\",PROPER(LEFT('PJ-JV'!F93,4)))","v":""},{"$f":"IF('PJ-JV'!D93=0,\"\",LEFT('PJ-JV'!G93,9))","v":""},{"$f":"IF('PJ-JV'!D93=0,\"\",LEFT('PJ-JV'!H93,6))","v":""},{"$f":"IF('PJ-JV'!D93=0,\"\",LEFT('PJ-JV'!I93,24))","v":""},{"$f":"IF('PJ-JV'!D93=0,\"\",LEFT('PJ-JV'!J93,18))","v":""},{"$f":"IF('PJ-JV'!D93=0,\"\",LEFT('PJ-JV'!K93,50))","v":""},{"$f":"IF('PJ-JV'!D93=0,\"\",LEFT('PJ-JV'!L93,8))","v":""},{"$f":"IF('PJ-JV'!D93=0,\"\",LEFT('PJ-JV'!M93,10))","v":""},{"$f":"IF('PJ-JV'!D93=0,\"\",LEFT('PJ-JV'!N93,3))","v":""},{"$f":"IF('PJ-JV'!D93=0,\"\",LEFT('PJ-JV'!O93,6))","v":""},{"$f":"IF('PJ-JV'!D93=0,\"\",LEFT('PJ-JV'!P93,4))","v":""},{"$f":"IF('PJ-JV'!D93=0,\"\",LEFT('PJ-JV'!Q93,5))","v":""},{"$f":"IF('PJ-JV'!D93=0,\"\",LEFT('PJ-JV'!R93,4))","v":""},{"$f":"IF('PJ-JV'!D93=0,\"\",LEFT('PJ-JV'!S93,12))","v":""},{"$f":"IF('PJ-JV'!D93=0,\"\",LEFT('PJ-JV'!T93,12))","v":""},{"$f":"IF('PJ-JV'!D93=0,\"\",LEFT('PJ-JV'!U93,20))","v":""}]
[{"$f":"IF('PJ-JV'!D94=0,\"\",\"IT\")","v":""},null,{"$f":"IF('PJ-JV'!D94=0,\"\",'PJ-JV'!B94)","v":""},null,null,null,null,null,null,null,null,{"$f":"IF('PJ-JV'!D94=0,\"\",LEFT('PJ-JV'!C94,6))","v":""},{"$f":"IF('PJ-JV'!D94=0,\"\",ROUND('PJ-JV'!D94,2))","v":""},{"$f":"IF('PJ-JV'!D94=0,\"\",LEFT('PJ-JV'!E94,6))","v":""},{"$f":"IF('PJ-JV'!D94=0,\"\",PROPER(LEFT('PJ-JV'!F94,4)))","v":""},{"$f":"IF('PJ-JV'!D94=0,\"\",LEFT('PJ-JV'!G94,9))","v":""},{"$f":"IF('PJ-JV'!D94=0,\"\",LEFT('PJ-JV'!H94,6))","v":""},{"$f":"IF('PJ-JV'!D94=0,\"\",LEFT('PJ-JV'!I94,24))","v":""},{"$f":"IF('PJ-JV'!D94=0,\"\",LEFT('PJ-JV'!J94,18))","v":""},{"$f":"IF('PJ-JV'!D94=0,\"\",LEFT('PJ-JV'!K94,50))","v":""},{"$f":"IF('PJ-JV'!D94=0,\"\",LEFT('PJ-JV'!L94,8))","v":""},{"$f":"IF('PJ-JV'!D94=0,\"\",LEFT('PJ-JV'!M94,10))","v":""},{"$f":"IF('PJ-JV'!D94=0,\"\",LEFT('PJ-JV'!N94,3))","v":""},{"$f":"IF('PJ-JV'!D94=0,\"\",LEFT('PJ-JV'!O94,6))","v":""},{"$f":"IF('PJ-JV'!D94=0,\"\",LEFT('PJ-JV'!P94,4))","v":""},{"$f":"IF('PJ-JV'!D94=0,\"\",LEFT('PJ-JV'!Q94,5))","v":""},{"$f":"IF('PJ-JV'!D94=0,\"\",LEFT('PJ-JV'!R94,4))","v":""},{"$f":"IF('PJ-JV'!D94=0,\"\",LEFT('PJ-JV'!S94,12))","v":""},{"$f":"IF('PJ-JV'!D94=0,\"\",LEFT('PJ-JV'!T94,12))","v":""},{"$f":"IF('PJ-JV'!D94=0,\"\",LEFT('PJ-JV'!U94,20))","v":""}]
[{"$f":"IF('PJ-JV'!D95=0,\"\",\"IT\")","v":""},null,{"$f":"IF('PJ-JV'!D95=0,\"\",'PJ-JV'!B95)","v":""},null,null,null,null,null,null,null,null,{"$f":"IF('PJ-JV'!D95=0,\"\",LEFT('PJ-JV'!C95,6))","v":""},{"$f":"IF('PJ-JV'!D95=0,\"\",ROUND('PJ-JV'!D95,2))","v":""},{"$f":"IF('PJ-JV'!D95=0,\"\",LEFT('PJ-JV'!E95,6))","v":""},{"$f":"IF('PJ-JV'!D95=0,\"\",PROPER(LEFT('PJ-JV'!F95,4)))","v":""},{"$f":"IF('PJ-JV'!D95=0,\"\",LEFT('PJ-JV'!G95,9))","v":""},{"$f":"IF('PJ-JV'!D95=0,\"\",LEFT('PJ-JV'!H95,6))","v":""},{"$f":"IF('PJ-JV'!D95=0,\"\",LEFT('PJ-JV'!I95,24))","v":""},{"$f":"IF('PJ-JV'!D95=0,\"\",LEFT('PJ-JV'!J95,18))","v":""},{"$f":"IF('PJ-JV'!D95=0,\"\",LEFT('PJ-JV'!K95,50))","v":""},{"$f":"IF('PJ-JV'!D95=0,\"\",LEFT('PJ-JV'!L95,8))","v":""},{"$f":"IF('PJ-JV'!D95=0,\"\",LEFT('PJ-JV'!M95,10))","v":""},{"$f":"IF('PJ-JV'!D95=0,\"\",LEFT('PJ-JV'!N95,3))","v":""},{"$f":"IF('PJ-JV'!D95=0,\"\",LEFT('PJ-JV'!O95,6))","v":""},{"$f":"IF('PJ-JV'!D95=0,\"\",LEFT('PJ-JV'!P95,4))","v":""},{"$f":"IF('PJ-JV'!D95=0,\"\",LEFT('PJ-JV'!Q95,5))","v":""},{"$f":"IF('PJ-JV'!D95=0,\"\",LEFT('PJ-JV'!R95,4))","v":""},{"$f":"IF('PJ-JV'!D95=0,\"\",LEFT('PJ-JV'!S95,12))","v":""},{"$f":"IF('PJ-JV'!D95=0,\"\",LEFT('PJ-JV'!T95,12))","v":""},{"$f":"IF('PJ-JV'!D95=0,\"\",LEFT('PJ-JV'!U95,20))","v":""}]
[{"$f":"IF('PJ-JV'!D96=0,\"\",\"IT\")","v":""},null,{"$f":"IF('PJ-JV'!D96=0,\"\",'PJ-JV'!B96)","v":""},null,null,null,null,null,null,null,null,{"$f":"IF('PJ-JV'!D96=0,\"\",LEFT('PJ-JV'!C96,6))","v":""},{"$f":"IF('PJ-JV'!D96=0,\"\",ROUND('PJ-JV'!D96,2))","v":""},{"$f":"IF('PJ-JV'!D96=0,\"\",LEFT('PJ-JV'!E96,6))","v":""},{"$f":"IF('PJ-JV'!D96=0,\"\",PROPER(LEFT('PJ-JV'!F96,4)))","v":""},{"$f":"IF('PJ-JV'!D96=0,\"\",LEFT('PJ-JV'!G96,9))","v":""},{"$f":"IF('PJ-JV'!D96=0,\"\",LEFT('PJ-JV'!H96,6))","v":""},{"$f":"IF('PJ-JV'!D96=0,\"\",LEFT('PJ-JV'!I96,24))","v":""},{"$f":"IF('PJ-JV'!D96=0,\"\",LEFT('PJ-JV'!J96,18))","v":""},{"$f":"IF('PJ-JV'!D96=0,\"\",LEFT('PJ-JV'!K96,50))","v":""},{"$f":"IF('PJ-JV'!D96=0,\"\",LEFT('PJ-JV'!L96,8))","v":""},{"$f":"IF('PJ-JV'!D96=0,\"\",LEFT('PJ-JV'!M96,10))","v":""},{"$f":"IF('PJ-JV'!D96=0,\"\",LEFT('PJ-JV'!N96,3))","v":""},{"$f":"IF('PJ-JV'!D96=0,\"\",LEFT('PJ-JV'!O96,6))","v":""},{"$f":"IF('PJ-JV'!D96=0,\"\",LEFT('PJ-JV'!P96,4))","v":""},{"$f":"IF('PJ-JV'!D96=0,\"\",LEFT('PJ-JV'!Q96,5))","v":""},{"$f":"IF('PJ-JV'!D96=0,\"\",LEFT('PJ-JV'!R96,4))","v":""},{"$f":"IF('PJ-JV'!D96=0,\"\",LEFT('PJ-JV'!S96,12))","v":""},{"$f":"IF('PJ-JV'!D96=0,\"\",LEFT('PJ-JV'!T96,12))","v":""},{"$f":"IF('PJ-JV'!D96=0,\"\",LEFT('PJ-JV'!U96,20))","v":""}]
[{"$f":"IF('PJ-JV'!D97=0,\"\",\"IT\")","v":""},null,{"$f":"IF('PJ-JV'!D97=0,\"\",'PJ-JV'!B97)","v":""},null,null,null,null,null,null,null,null,{"$f":"IF('PJ-JV'!D97=0,\"\",LEFT('PJ-JV'!C97,6))","v":""},{"$f":"IF('PJ-JV'!D97=0,\"\",ROUND('PJ-JV'!D97,2))","v":""},{"$f":"IF('PJ-JV'!D97=0,\"\",LEFT('PJ-JV'!E97,6))","v":""},{"$f":"IF('PJ-JV'!D97=0,\"\",PROPER(LEFT('PJ-JV'!F97,4)))","v":""},{"$f":"IF('PJ-JV'!D97=0,\"\",LEFT('PJ-JV'!G97,9))","v":""},{"$f":"IF('PJ-JV'!D97=0,\"\",LEFT('PJ-JV'!H97,6))","v":""},{"$f":"IF('PJ-JV'!D97=0,\"\",LEFT('PJ-JV'!I97,24))","v":""},{"$f":"IF('PJ-JV'!D97=0,\"\",LEFT('PJ-JV'!J97,18))","v":""},{"$f":"IF('PJ-JV'!D97=0,\"\",LEFT('PJ-JV'!K97,50))","v":""},{"$f":"IF('PJ-JV'!D97=0,\"\",LEFT('PJ-JV'!L97,8))","v":""},{"$f":"IF('PJ-JV'!D97=0,\"\",LEFT('PJ-JV'!M97,10))","v":""},{"$f":"IF('PJ-JV'!D97=0,\"\",LEFT('PJ-JV'!N97,3))","v":""},{"$f":"IF('PJ-JV'!D97=0,\"\",LEFT('PJ-JV'!O97,6))","v":""},{"$f":"IF('PJ-JV'!D97=0,\"\",LEFT('PJ-JV'!P97,4))","v":""},{"$f":"IF('PJ-JV'!D97=0,\"\",LEFT('PJ-JV'!Q97,5))","v":""},{"$f":"IF('PJ-JV'!D97=0,\"\",LEFT('PJ-JV'!R97,4))","v":""},{"$f":"IF('PJ-JV'!D97=0,\"\",LEFT('PJ-JV'!S97,12))","v":""},{"$f":"IF('PJ-JV'!D97=0,\"\",LEFT('PJ-JV'!T97,12))","v":""},{"$f":"IF('PJ-JV'!D97=0,\"\",LEFT('PJ-JV'!U97,20))","v":""}]
[{"$f":"IF('PJ-JV'!D98=0,\"\",\"IT\")","v":""},null,{"$f":"IF('PJ-JV'!D98=0,\"\",'PJ-JV'!B98)","v":""},null,null,null,null,null,null,null,null,{"$f":"IF('PJ-JV'!D98=0,\"\",LEFT('PJ-JV'!C98,6))","v":""},{"$f":"IF('PJ-JV'!D98=0,\"\",ROUND('PJ-JV'!D98,2))","v":""},{"$f":"IF('PJ-JV'!D98=0,\"\",LEFT('PJ-JV'!E98,6))","v":""},{"$f":"IF('PJ-JV'!D98=0,\"\",PROPER(LEFT('PJ-JV'!F98,4)))","v":""},{"$f":"IF('PJ-JV'!D98=0,\"\",LEFT('PJ-JV'!G98,9))","v":""},{"$f":"IF('PJ-JV'!D98=0,\"\",LEFT('PJ-JV'!H98,6))","v":""},{"$f":"IF('PJ-JV'!D98=0,\"\",LEFT('PJ-JV'!I98,24))","v":""},{"$f":"IF('PJ-JV'!D98=0,\"\",LEFT('PJ-JV'!J98,18))","v":""},{"$f":"IF('PJ-JV'!D98=0,\"\",LEFT('PJ-JV'!K98,50))","v":""},{"$f":"IF('PJ-JV'!D98=0,\"\",LEFT('PJ-JV'!L98,8))","v":""},{"$f":"IF('PJ-JV'!D98=0,\"\",LEFT('PJ-JV'!M98,10))","v":""},{"$f":"IF('PJ-JV'!D98=0,\"\",LEFT('PJ-JV'!N98,3))","v":""},{"$f":"IF('PJ-JV'!D98=0,\"\",LEFT('PJ-JV'!O98,6))","v":""},{"$f":"IF('PJ-JV'!D98=0,\"\",LEFT('PJ-JV'!P98,4))","v":""},{"$f":"IF('PJ-JV'!D98=0,\"\",LEFT('PJ-JV'!Q98,5))","v":""},{"$f":"IF('PJ-JV'!D98=0,\"\",LEFT('PJ-JV'!R98,4))","v":""},{"$f":"IF('PJ-JV'!D98=0,\"\",LEFT('PJ-JV'!S98,12))","v":""},{"$f":"IF('PJ-JV'!D98=0,\"\",LEFT('PJ-JV'!T98,12))","v":""},{"$f":"IF('PJ-JV'!D98=0,\"\",LEFT('PJ-JV'!U98,20))","v":""}]
[{"$f":"IF('PJ-JV'!D99=0,\"\",\"IT\")","v":""},null,{"$f":"IF('PJ-JV'!D99=0,\"\",'PJ-JV'!B99)","v":""},null,null,null,null,null,null,null,null,{"$f":"IF('PJ-JV'!D99=0,\"\",LEFT('PJ-JV'!C99,6))","v":""},{"$f":"IF('PJ-JV'!D99=0,\"\",ROUND('PJ-JV'!D99,2))","v":""},{"$f":"IF('PJ-JV'!D99=0,\"\",LEFT('PJ-JV'!E99,6))","v":""},{"$f":"IF('PJ-JV'!D99=0,\"\",PROPER(LEFT('PJ-JV'!F99,4)))","v":""},{"$f":"IF('PJ-JV'!D99=0,\"\",LEFT('PJ-JV'!G99,9))","v":""},{"$f":"IF('PJ-JV'!D99=0,\"\",LEFT('PJ-JV'!H99,6))","v":""},{"$f":"IF('PJ-JV'!D99=0,\"\",LEFT('PJ-JV'!I99,24))","v":""},{"$f":"IF('PJ-JV'!D99=0,\"\",LEFT('PJ-JV'!J99,18))","v":""},{"$f":"IF('PJ-JV'!D99=0,\"\",LEFT('PJ-JV'!K99,50))","v":""},{"$f":"IF('PJ-JV'!D99=0,\"\",LEFT('PJ-JV'!L99,8))","v":""},{"$f":"IF('PJ-JV'!D99=0,\"\",LEFT('PJ-JV'!M99,10))","v":""},{"$f":"IF('PJ-JV'!D99=0,\"\",LEFT('PJ-JV'!N99,3))","v":""},{"$f":"IF('PJ-JV'!D99=0,\"\",LEFT('PJ-JV'!O99,6))","v":""},{"$f":"IF('PJ-JV'!D99=0,\"\",LEFT('PJ-JV'!P99,4))","v":""},{"$f":"IF('PJ-JV'!D99=0,\"\",LEFT('PJ-JV'!Q99,5))","v":""},{"$f":"IF('PJ-JV'!D99=0,\"\",LEFT('PJ-JV'!R99,4))","v":""},{"$f":"IF('PJ-JV'!D99=0,\"\",LEFT('PJ-JV'!S99,12))","v":""},{"$f":"IF('PJ-JV'!D99=0,\"\",LEFT('PJ-JV'!T99,12))","v":""},{"$f":"IF('PJ-JV'!D99=0,\"\",LEFT('PJ-JV'!U99,20))","v":""}]
[{"$f":"IF('PJ-JV'!D100=0,\"\",\"IT\")","v":""},null,{"$f":"IF('PJ-JV'!D100=0,\"\",'PJ-JV'!B100)","v":""},null,null,null,null,null,null,null,null,{"$f":"IF('PJ-JV'!D100=0,\"\",LEFT('PJ-JV'!C100,6))","v":""},{"$f":"IF('PJ-JV'!D100=0,\"\",ROUND('PJ-JV'!D100,2))","v":""},{"$f":"IF('PJ-JV'!D100=0,\"\",LEFT('PJ-JV'!E100,6))","v":""},{"$f":"IF('PJ-JV'!D100=0,\"\",PROPER(LEFT('PJ-JV'!F100,4)))","v":""},{"$f":"IF('PJ-JV'!D100=0,\"\",LEFT('PJ-JV'!G100,9))","v":""},{"$f":"IF('PJ-JV'!D100=0,\"\",LEFT('PJ-JV'!H100,6))","v":""},{"$f":"IF('PJ-JV'!D100=0,\"\",LEFT('PJ-JV'!I100,24))","v":""},{"$f":"IF('PJ-JV'!D100=0,\"\",LEFT('PJ-JV'!J100,18))","v":""},{"$f":"IF('PJ-JV'!D100=0,\"\",LEFT('PJ-JV'!K100,50))","v":""},{"$f":"IF('PJ-JV'!D100=0,\"\",LEFT('PJ-JV'!L100,8))","v":""},{"$f":"IF('PJ-JV'!D100=0,\"\",LEFT('PJ-JV'!M100,10))","v":""},{"$f":"IF('PJ-JV'!D100=0,\"\",LEFT('PJ-JV'!N100,3))","v":""},{"$f":"IF('PJ-JV'!D100=0,\"\",LEFT('PJ-JV'!O100,6))","v":""},{"$f":"IF('PJ-JV'!D100=0,\"\",LEFT('PJ-JV'!P100,4))","v":""},{"$f":"IF('PJ-JV'!D100=0,\"\",LEFT('PJ-JV'!Q100,5))","v":""},{"$f":"IF('PJ-JV'!D100=0,\"\",LEFT('PJ-JV'!R100,4))","v":""},{"$f":"IF('PJ-JV'!D100=0,\"\",LEFT('PJ-JV'!S100,12))","v":""},{"$f":"IF('PJ-JV'!D100=0,\"\",LEFT('PJ-JV'!T100,12))","v":""},{"$f":"IF('PJ-JV'!D100=0,\"\",LEFT('PJ-JV'!U100,20))","v":""}]
[{"$f":"IF('PJ-JV'!D101=0,\"\",\"IT\")","v":""},null,{"$f":"IF('PJ-JV'!D101=0,\"\",'PJ-JV'!B101)","v":""},null,null,null,null,null,null,null,null,{"$f":"IF('PJ-JV'!D101=0,\"\",LEFT('PJ-JV'!C101,6))","v":""},{"$f":"IF('PJ-JV'!D101=0,\"\",ROUND('PJ-JV'!D101,2))","v":""},{"$f":"IF('PJ-JV'!D101=0,\"\",LEFT('PJ-JV'!E101,6))","v":""},{"$f":"IF('PJ-JV'!D101=0,\"\",PROPER(LEFT('PJ-JV'!F101,4)))","v":""},{"$f":"IF('PJ-JV'!D101=0,\"\",LEFT('PJ-JV'!G101,9))","v":""},{"$f":"IF('PJ-JV'!D101=0,\"\",LEFT('PJ-JV'!H101,6))","v":""},{"$f":"IF('PJ-JV'!D101=0,\"\",LEFT('PJ-JV'!I101,24))","v":""},{"$f":"IF('PJ-JV'!D101=0,\"\",LEFT('PJ-JV'!J101,18))","v":""},{"$f":"IF('PJ-JV'!D101=0,\"\",LEFT('PJ-JV'!K101,50))","v":""},{"$f":"IF('PJ-JV'!D101=0,\"\",LEFT('PJ-JV'!L101,8))","v":""},{"$f":"IF('PJ-JV'!D101=0,\"\",LEFT('PJ-JV'!M101,10))","v":""},{"$f":"IF('PJ-JV'!D101=0,\"\",LEFT('PJ-JV'!N101,3))","v":""},{"$f":"IF('PJ-JV'!D101=0,\"\",LEFT('PJ-JV'!O101,6))","v":""},{"$f":"IF('PJ-JV'!D101=0,\"\",LEFT('PJ-JV'!P101,4))","v":""},{"$f":"IF('PJ-JV'!D101=0,\"\",LEFT('PJ-JV'!Q101,5))","v":""},{"$f":"IF('PJ-JV'!D101=0,\"\",LEFT('PJ-JV'!R101,4))","v":""},{"$f":"IF('PJ-JV'!D101=0,\"\",LEFT('PJ-JV'!S101,12))","v":""},{"$f":"IF('PJ-JV'!D101=0,\"\",LEFT('PJ-JV'!T101,12))","v":""},{"$f":"IF('PJ-JV'!D101=0,\"\",LEFT('PJ-JV'!U101,20))","v":""}]
[{"$f":"IF('PJ-JV'!D102=0,\"\",\"IT\")","v":""},null,{"$f":"IF('PJ-JV'!D102=0,\"\",'PJ-JV'!B102)","v":""},null,null,null,null,null,null,null,null,{"$f":"IF('PJ-JV'!D102=0,\"\",LEFT('PJ-JV'!C102,6))","v":""},{"$f":"IF('PJ-JV'!D102=0,\"\",ROUND('PJ-JV'!D102,2))","v":""},{"$f":"IF('PJ-JV'!D102=0,\"\",LEFT('PJ-JV'!E102,6))","v":""},{"$f":"IF('PJ-JV'!D102=0,\"\",PROPER(LEFT('PJ-JV'!F102,4)))","v":""},{"$f":"IF('PJ-JV'!D102=0,\"\",LEFT('PJ-JV'!G102,9))","v":""},{"$f":"IF('PJ-JV'!D102=0,\"\",LEFT('PJ-JV'!H102,6))","v":""},{"$f":"IF('PJ-JV'!D102=0,\"\",LEFT('PJ-JV'!I102,24))","v":""},{"$f":"IF('PJ-JV'!D102=0,\"\",LEFT('PJ-JV'!J102,18))","v":""},{"$f":"IF('PJ-JV'!D102=0,\"\",LEFT('PJ-JV'!K102,50))","v":""},{"$f":"IF('PJ-JV'!D102=0,\"\",LEFT('PJ-JV'!L102,8))","v":""},{"$f":"IF('PJ-JV'!D102=0,\"\",LEFT('PJ-JV'!M102,10))","v":""},{"$f":"IF('PJ-JV'!D102=0,\"\",LEFT('PJ-JV'!N102,3))","v":""},{"$f":"IF('PJ-JV'!D102=0,\"\",LEFT('PJ-JV'!O102,6))","v":""},{"$f":"IF('PJ-JV'!D102=0,\"\",LEFT('PJ-JV'!P102,4))","v":""},{"$f":"IF('PJ-JV'!D102=0,\"\",LEFT('PJ-JV'!Q102,5))","v":""},{"$f":"IF('PJ-JV'!D102=0,\"\",LEFT('PJ-JV'!R102,4))","v":""},{"$f":"IF('PJ-JV'!D102=0,\"\",LEFT('PJ-JV'!S102,12))","v":""},{"$f":"IF('PJ-JV'!D102=0,\"\",LEFT('PJ-JV'!T102,12))","v":""},{"$f":"IF('PJ-JV'!D102=0,\"\",LEFT('PJ-JV'!U102,20))","v":""}]
[{"$f":"IF('PJ-JV'!D103=0,\"\",\"IT\")","v":""},null,{"$f":"IF('PJ-JV'!D103=0,\"\",'PJ-JV'!B103)","v":""},null,null,null,null,null,null,null,null,{"$f":"IF('PJ-JV'!D103=0,\"\",LEFT('PJ-JV'!C103,6))","v":""},{"$f":"IF('PJ-JV'!D103=0,\"\",ROUND('PJ-JV'!D103,2))","v":""},{"$f":"IF('PJ-JV'!D103=0,\"\",LEFT('PJ-JV'!E103,6))","v":""},{"$f":"IF('PJ-JV'!D103=0,\"\",PROPER(LEFT('PJ-JV'!F103,4)))","v":""},{"$f":"IF('PJ-JV'!D103=0,\"\",LEFT('PJ-JV'!G103,9))","v":""},{"$f":"IF('PJ-JV'!D103=0,\"\",LEFT('PJ-JV'!H103,6))","v":""},{"$f":"IF('PJ-JV'!D103=0,\"\",LEFT('PJ-JV'!I103,24))","v":""},{"$f":"IF('PJ-JV'!D103=0,\"\",LEFT('PJ-JV'!J103,18))","v":""},{"$f":"IF('PJ-JV'!D103=0,\"\",LEFT('PJ-JV'!K103,50))","v":""},{"$f":"IF('PJ-JV'!D103=0,\"\",LEFT('PJ-JV'!L103,8))","v":""},{"$f":"IF('PJ-JV'!D103=0,\"\",LEFT('PJ-JV'!M103,10))","v":""},{"$f":"IF('PJ-JV'!D103=0,\"\",LEFT('PJ-JV'!N103,3))","v":""},{"$f":"IF('PJ-JV'!D103=0,\"\",LEFT('PJ-JV'!O103,6))","v":""},{"$f":"IF('PJ-JV'!D103=0,\"\",LEFT('PJ-JV'!P103,4))","v":""},{"$f":"IF('PJ-JV'!D103=0,\"\",LEFT('PJ-JV'!Q103,5))","v":""},{"$f":"IF('PJ-JV'!D103=0,\"\",LEFT('PJ-JV'!R103,4))","v":""},{"$f":"IF('PJ-JV'!D103=0,\"\",LEFT('PJ-JV'!S103,12))","v":""},{"$f":"IF('PJ-JV'!D103=0,\"\",LEFT('PJ-JV'!T103,12))","v":""},{"$f":"IF('PJ-JV'!D103=0,\"\",LEFT('PJ-JV'!U103,20))","v":""}]
[{"$f":"IF('PJ-JV'!D104=0,\"\",\"IT\")","v":""},null,{"$f":"IF('PJ-JV'!D104=0,\"\",'PJ-JV'!B104)","v":""},null,null,null,null,null,null,null,null,{"$f":"IF('PJ-JV'!D104=0,\"\",LEFT('PJ-JV'!C104,6))","v":""},{"$f":"IF('PJ-JV'!D104=0,\"\",ROUND('PJ-JV'!D104,2))","v":""},{"$f":"IF('PJ-JV'!D104=0,\"\",LEFT('PJ-JV'!E104,6))","v":""},{"$f":"IF('PJ-JV'!D104=0,\"\",PROPER(LEFT('PJ-JV'!F104,4)))","v":""},{"$f":"IF('PJ-JV'!D104=0,\"\",LEFT('PJ-JV'!G104,9))","v":""},{"$f":"IF('PJ-JV'!D104=0,\"\",LEFT('PJ-JV'!H104,6))","v":""},{"$f":"IF('PJ-JV'!D104=0,\"\",LEFT('PJ-JV'!I104,24))","v":""},{"$f":"IF('PJ-JV'!D104=0,\"\",LEFT('PJ-JV'!J104,18))","v":""},{"$f":"IF('PJ-JV'!D104=0,\"\",LEFT('PJ-JV'!K104,50))","v":""},{"$f":"IF('PJ-JV'!D104=0,\"\",LEFT('PJ-JV'!L104,8))","v":""},{"$f":"IF('PJ-JV'!D104=0,\"\",LEFT('PJ-JV'!M104,10))","v":""},{"$f":"IF('PJ-JV'!D104=0,\"\",LEFT('PJ-JV'!N104,3))","v":""},{"$f":"IF('PJ-JV'!D104=0,\"\",LEFT('PJ-JV'!O104,6))","v":""},{"$f":"IF('PJ-JV'!D104=0,\"\",LEFT('PJ-JV'!P104,4))","v":""},{"$f":"IF('PJ-JV'!D104=0,\"\",LEFT('PJ-JV'!Q104,5))","v":""},{"$f":"IF('PJ-JV'!D104=0,\"\",LEFT('PJ-JV'!R104,4))","v":""},{"$f":"IF('PJ-JV'!D104=0,\"\",LEFT('PJ-JV'!S104,12))","v":""},{"$f":"IF('PJ-JV'!D104=0,\"\",LEFT('PJ-JV'!T104,12))","v":""},{"$f":"IF('PJ-JV'!D104=0,\"\",LEFT('PJ-JV'!U104,20))","v":""}]
[{"$f":"IF('PJ-JV'!D105=0,\"\",\"IT\")","v":""},null,{"$f":"IF('PJ-JV'!D105=0,\"\",'PJ-JV'!B105)","v":""},null,null,null,null,null,null,null,null,{"$f":"IF('PJ-JV'!D105=0,\"\",LEFT('PJ-JV'!C105,6))","v":""},{"$f":"IF('PJ-JV'!D105=0,\"\",ROUND('PJ-JV'!D105,2))","v":""},{"$f":"IF('PJ-JV'!D105=0,\"\",LEFT('PJ-JV'!E105,6))","v":""},{"$f":"IF('PJ-JV'!D105=0,\"\",PROPER(LEFT('PJ-JV'!F105,4)))","v":""},{"$f":"IF('PJ-JV'!D105=0,\"\",LEFT('PJ-JV'!G105,9))","v":""},{"$f":"IF('PJ-JV'!D105=0,\"\",LEFT('PJ-JV'!H105,6))","v":""},{"$f":"IF('PJ-JV'!D105=0,\"\",LEFT('PJ-JV'!I105,24))","v":""},{"$f":"IF('PJ-JV'!D105=0,\"\",LEFT('PJ-JV'!J105,18))","v":""},{"$f":"IF('PJ-JV'!D105=0,\"\",LEFT('PJ-JV'!K105,50))","v":""},{"$f":"IF('PJ-JV'!D105=0,\"\",LEFT('PJ-JV'!L105,8))","v":""},{"$f":"IF('PJ-JV'!D105=0,\"\",LEFT('PJ-JV'!M105,10))","v":""},{"$f":"IF('PJ-JV'!D105=0,\"\",LEFT('PJ-JV'!N105,3))","v":""},{"$f":"IF('PJ-JV'!D105=0,\"\",LEFT('PJ-JV'!O105,6))","v":""},{"$f":"IF('PJ-JV'!D105=0,\"\",LEFT('PJ-JV'!P105,4))","v":""},{"$f":"IF('PJ-JV'!D105=0,\"\",LEFT('PJ-JV'!Q105,5))","v":""},{"$f":"IF('PJ-JV'!D105=0,\"\",LEFT('PJ-JV'!R105,4))","v":""},{"$f":"IF('PJ-JV'!D105=0,\"\",LEFT('PJ-JV'!S105,12))","v":""},{"$f":"IF('PJ-JV'!D105=0,\"\",LEFT('PJ-JV'!T105,12))","v":""},{"$f":"IF('PJ-JV'!D105=0,\"\",LEFT('PJ-JV'!U105,20))","v":""}]
[{"$f":"IF('PJ-JV'!D106=0,\"\",\"IT\")","v":""},null,{"$f":"IF('PJ-JV'!D106=0,\"\",'PJ-JV'!B106)","v":""},null,null,null,null,null,null,null,null,{"$f":"IF('PJ-JV'!D106=0,\"\",LEFT('PJ-JV'!C106,6))","v":""},{"$f":"IF('PJ-JV'!D106=0,\"\",ROUND('PJ-JV'!D106,2))","v":""},{"$f":"IF('PJ-JV'!D106=0,\"\",LEFT('PJ-JV'!E106,6))","v":""},{"$f":"IF('PJ-JV'!D106=0,\"\",PROPER(LEFT('PJ-JV'!F106,4)))","v":""},{"$f":"IF('PJ-JV'!D106=0,\"\",LEFT('PJ-JV'!G106,9))","v":""},{"$f":"IF('PJ-JV'!D106=0,\"\",LEFT('PJ-JV'!H106,6))","v":""},{"$f":"IF('PJ-JV'!D106=0,\"\",LEFT('PJ-JV'!I106,24))","v":""},{"$f":"IF('PJ-JV'!D106=0,\"\",LEFT('PJ-JV'!J106,18))","v":""},{"$f":"IF('PJ-JV'!D106=0,\"\",LEFT('PJ-JV'!K106,50))","v":""},{"$f":"IF('PJ-JV'!D106=0,\"\",LEFT('PJ-JV'!L106,8))","v":""},{"$f":"IF('PJ-JV'!D106=0,\"\",LEFT('PJ-JV'!M106,10))","v":""},{"$f":"IF('PJ-JV'!D106=0,\"\",LEFT('PJ-JV'!N106,3))","v":""},{"$f":"IF('PJ-JV'!D106=0,\"\",LEFT('PJ-JV'!O106,6))","v":""},{"$f":"IF('PJ-JV'!D106=0,\"\",LEFT('PJ-JV'!P106,4))","v":""},{"$f":"IF('PJ-JV'!D106=0,\"\",LEFT('PJ-JV'!Q106,5))","v":""},{"$f":"IF('PJ-JV'!D106=0,\"\",LEFT('PJ-JV'!R106,4))","v":""},{"$f":"IF('PJ-JV'!D106=0,\"\",LEFT('PJ-JV'!S106,12))","v":""},{"$f":"IF('PJ-JV'!D106=0,\"\",LEFT('PJ-JV'!T106,12))","v":""},{"$f":"IF('PJ-JV'!D106=0,\"\",LEFT('PJ-JV'!U106,20))","v":""}]
[{"$f":"IF('PJ-JV'!D107=0,\"\",\"IT\")","v":""},null,{"$f":"IF('PJ-JV'!D107=0,\"\",'PJ-JV'!B107)","v":""},null,null,null,null,null,null,null,null,{"$f":"IF('PJ-JV'!D107=0,\"\",LEFT('PJ-JV'!C107,6))","v":""},{"$f":"IF('PJ-JV'!D107=0,\"\",ROUND('PJ-JV'!D107,2))","v":""},{"$f":"IF('PJ-JV'!D107=0,\"\",LEFT('PJ-JV'!E107,6))","v":""},{"$f":"IF('PJ-JV'!D107=0,\"\",PROPER(LEFT('PJ-JV'!F107,4)))","v":""},{"$f":"IF('PJ-JV'!D107=0,\"\",LEFT('PJ-JV'!G107,9))","v":""},{"$f":"IF('PJ-JV'!D107=0,\"\",LEFT('PJ-JV'!H107,6))","v":""},{"$f":"IF('PJ-JV'!D107=0,\"\",LEFT('PJ-JV'!I107,24))","v":""},{"$f":"IF('PJ-JV'!D107=0,\"\",LEFT('PJ-JV'!J107,18))","v":""},{"$f":"IF('PJ-JV'!D107=0,\"\",LEFT('PJ-JV'!K107,50))","v":""},{"$f":"IF('PJ-JV'!D107=0,\"\",LEFT('PJ-JV'!L107,8))","v":""},{"$f":"IF('PJ-JV'!D107=0,\"\",LEFT('PJ-JV'!M107,10))","v":""},{"$f":"IF('PJ-JV'!D107=0,\"\",LEFT('PJ-JV'!N107,3))","v":""},{"$f":"IF('PJ-JV'!D107=0,\"\",LEFT('PJ-JV'!O107,6))","v":""},{"$f":"IF('PJ-JV'!D107=0,\"\",LEFT('PJ-JV'!P107,4))","v":""},{"$f":"IF('PJ-JV'!D107=0,\"\",LEFT('PJ-JV'!Q107,5))","v":""},{"$f":"IF('PJ-JV'!D107=0,\"\",LEFT('PJ-JV'!R107,4))","v":""},{"$f":"IF('PJ-JV'!D107=0,\"\",LEFT('PJ-JV'!S107,12))","v":""},{"$f":"IF('PJ-JV'!D107=0,\"\",LEFT('PJ-JV'!T107,12))","v":""},{"$f":"IF('PJ-JV'!D107=0,\"\",LEFT('PJ-JV'!U107,20))","v":""}]
[{"$f":"IF('PJ-JV'!D108=0,\"\",\"IT\")","v":""},null,{"$f":"IF('PJ-JV'!D108=0,\"\",'PJ-JV'!B108)","v":""},null,null,null,null,null,null,null,null,{"$f":"IF('PJ-JV'!D108=0,\"\",LEFT('PJ-JV'!C108,6))","v":""},{"$f":"IF('PJ-JV'!D108=0,\"\",ROUND('PJ-JV'!D108,2))","v":""},{"$f":"IF('PJ-JV'!D108=0,\"\",LEFT('PJ-JV'!E108,6))","v":""},{"$f":"IF('PJ-JV'!D108=0,\"\",PROPER(LEFT('PJ-JV'!F108,4)))","v":""},{"$f":"IF('PJ-JV'!D108=0,\"\",LEFT('PJ-JV'!G108,9))","v":""},{"$f":"IF('PJ-JV'!D108=0,\"\",LEFT('PJ-JV'!H108,6))","v":""},{"$f":"IF('PJ-JV'!D108=0,\"\",LEFT('PJ-JV'!I108,24))","v":""},{"$f":"IF('PJ-JV'!D108=0,\"\",LEFT('PJ-JV'!J108,18))","v":""},{"$f":"IF('PJ-JV'!D108=0,\"\",LEFT('PJ-JV'!K108,50))","v":""},{"$f":"IF('PJ-JV'!D108=0,\"\",LEFT('PJ-JV'!L108,8))","v":""},{"$f":"IF('PJ-JV'!D108=0,\"\",LEFT('PJ-JV'!M108,10))","v":""},{"$f":"IF('PJ-JV'!D108=0,\"\",LEFT('PJ-JV'!N108,3))","v":""},{"$f":"IF('PJ-JV'!D108=0,\"\",LEFT('PJ-JV'!O108,6))","v":""},{"$f":"IF('PJ-JV'!D108=0,\"\",LEFT('PJ-JV'!P108,4))","v":""},{"$f":"IF('PJ-JV'!D108=0,\"\",LEFT('PJ-JV'!Q108,5))","v":""},{"$f":"IF('PJ-JV'!D108=0,\"\",LEFT('PJ-JV'!R108,4))","v":""},{"$f":"IF('PJ-JV'!D108=0,\"\",LEFT('PJ-JV'!S108,12))","v":""},{"$f":"IF('PJ-JV'!D108=0,\"\",LEFT('PJ-JV'!T108,12))","v":""},{"$f":"IF('PJ-JV'!D108=0,\"\",LEFT('PJ-JV'!U108,20))","v":""}]
[{"$f":"IF('PJ-JV'!D109=0,\"\",\"IT\")","v":""},null,{"$f":"IF('PJ-JV'!D109=0,\"\",'PJ-JV'!B109)","v":""},null,null,null,null,null,null,null,null,{"$f":"IF('PJ-JV'!D109=0,\"\",LEFT('PJ-JV'!C109,6))","v":""},{"$f":"IF('PJ-JV'!D109=0,\"\",ROUND('PJ-JV'!D109,2))","v":""},{"$f":"IF('PJ-JV'!D109=0,\"\",LEFT('PJ-JV'!E109,6))","v":""},{"$f":"IF('PJ-JV'!D109=0,\"\",PROPER(LEFT('PJ-JV'!F109,4)))","v":""},{"$f":"IF('PJ-JV'!D109=0,\"\",LEFT('PJ-JV'!G109,9))","v":""},{"$f":"IF('PJ-JV'!D109=0,\"\",LEFT('PJ-JV'!H109,6))","v":""},{"$f":"IF('PJ-JV'!D109=0,\"\",LEFT('PJ-JV'!I109,24))","v":""},{"$f":"IF('PJ-JV'!D109=0,\"\",LEFT('PJ-JV'!J109,18))","v":""},{"$f":"IF('PJ-JV'!D109=0,\"\",LEFT('PJ-JV'!K109,50))","v":""},{"$f":"IF('PJ-JV'!D109=0,\"\",LEFT('PJ-JV'!L109,8))","v":""},{"$f":"IF('PJ-JV'!D109=0,\"\",LEFT('PJ-JV'!M109,10))","v":""},{"$f":"IF('PJ-JV'!D109=0,\"\",LEFT('PJ-JV'!N109,3))","v":""},{"$f":"IF('PJ-JV'!D109=0,\"\",LEFT('PJ-JV'!O109,6))","v":""},{"$f":"IF('PJ-JV'!D109=0,\"\",LEFT('PJ-JV'!P109,4))","v":""},{"$f":"IF('PJ-JV'!D109=0,\"\",LEFT('PJ-JV'!Q109,5))","v":""},{"$f":"IF('PJ-JV'!D109=0,\"\",LEFT('PJ-JV'!R109,4))","v":""},{"$f":"IF('PJ-JV'!D109=0,\"\",LEFT('PJ-JV'!S109,12))","v":""},{"$f":"IF('PJ-JV'!D109=0,\"\",LEFT('PJ-JV'!T109,12))","v":""},{"$f":"IF('PJ-JV'!D109=0,\"\",LEFT('PJ-JV'!U109,20))","v":""}]
[{"$f":"IF('PJ-JV'!D110=0,\"\",\"IT\")","v":""},null,{"$f":"IF('PJ-JV'!D110=0,\"\",'PJ-JV'!B110)","v":""},null,null,null,null,null,null,null,null,{"$f":"IF('PJ-JV'!D110=0,\"\",LEFT('PJ-JV'!C110,6))","v":""},{"$f":"IF('PJ-JV'!D110=0,\"\",ROUND('PJ-JV'!D110,2))","v":""},{"$f":"IF('PJ-JV'!D110=0,\"\",LEFT('PJ-JV'!E110,6))","v":""},{"$f":"IF('PJ-JV'!D110=0,\"\",PROPER(LEFT('PJ-JV'!F110,4)))","v":""},{"$f":"IF('PJ-JV'!D110=0,\"\",LEFT('PJ-JV'!G110,9))","v":""},{"$f":"IF('PJ-JV'!D110=0,\"\",LEFT('PJ-JV'!H110,6))","v":""},{"$f":"IF('PJ-JV'!D110=0,\"\",LEFT('PJ-JV'!I110,24))","v":""},{"$f":"IF('PJ-JV'!D110=0,\"\",LEFT('PJ-JV'!J110,18))","v":""},{"$f":"IF('PJ-JV'!D110=0,\"\",LEFT('PJ-JV'!K110,50))","v":""},{"$f":"IF('PJ-JV'!D110=0,\"\",LEFT('PJ-JV'!L110,8))","v":""},{"$f":"IF('PJ-JV'!D110=0,\"\",LEFT('PJ-JV'!M110,10))","v":""},{"$f":"IF('PJ-JV'!D110=0,\"\",LEFT('PJ-JV'!N110,3))","v":""},{"$f":"IF('PJ-JV'!D110=0,\"\",LEFT('PJ-JV'!O110,6))","v":""},{"$f":"IF('PJ-JV'!D110=0,\"\",LEFT('PJ-JV'!P110,4))","v":""},{"$f":"IF('PJ-JV'!D110=0,\"\",LEFT('PJ-JV'!Q110,5))","v":""},{"$f":"IF('PJ-JV'!D110=0,\"\",LEFT('PJ-JV'!R110,4))","v":""},{"$f":"IF('PJ-JV'!D110=0,\"\",LEFT('PJ-JV'!S110,12))","v":""},{"$f":"IF('PJ-JV'!D110=0,\"\",LEFT('PJ-JV'!T110,12))","v":""},{"$f":"IF('PJ-JV'!D110=0,\"\",LEFT('PJ-JV'!U110,20))","v":""}]
[{"$f":"IF('PJ-JV'!D111=0,\"\",\"IT\")","v":""},null,{"$f":"IF('PJ-JV'!D111=0,\"\",'PJ-JV'!B111)","v":""},null,null,null,null,null,null,null,null,{"$f":"IF('PJ-JV'!D111=0,\"\",LEFT('PJ-JV'!C111,6))","v":""},{"$f":"IF('PJ-JV'!D111=0,\"\",ROUND('PJ-JV'!D111,2))","v":""},{"$f":"IF('PJ-JV'!D111=0,\"\",LEFT('PJ-JV'!E111,6))","v":""},{"$f":"IF('PJ-JV'!D111=0,\"\",PROPER(LEFT('PJ-JV'!F111,4)))","v":""},{"$f":"IF('PJ-JV'!D111=0,\"\",LEFT('PJ-JV'!G111,9))","v":""},{"$f":"IF('PJ-JV'!D111=0,\"\",LEFT('PJ-JV'!H111,6))","v":""},{"$f":"IF('PJ-JV'!D111=0,\"\",LEFT('PJ-JV'!I111,24))","v":""},{"$f":"IF('PJ-JV'!D111=0,\"\",LEFT('PJ-JV'!J111,18))","v":""},{"$f":"IF('PJ-JV'!D111=0,\"\",LEFT('PJ-JV'!K111,50))","v":""},{"$f":"IF('PJ-JV'!D111=0,\"\",LEFT('PJ-JV'!L111,8))","v":""},{"$f":"IF('PJ-JV'!D111=0,\"\",LEFT('PJ-JV'!M111,10))","v":""},{"$f":"IF('PJ-JV'!D111=0,\"\",LEFT('PJ-JV'!N111,3))","v":""},{"$f":"IF('PJ-JV'!D111=0,\"\",LEFT('PJ-JV'!O111,6))","v":""},{"$f":"IF('PJ-JV'!D111=0,\"\",LEFT('PJ-JV'!P111,4))","v":""},{"$f":"IF('PJ-JV'!D111=0,\"\",LEFT('PJ-JV'!Q111,5))","v":""},{"$f":"IF('PJ-JV'!D111=0,\"\",LEFT('PJ-JV'!R111,4))","v":""},{"$f":"IF('PJ-JV'!D111=0,\"\",LEFT('PJ-JV'!S111,12))","v":""},{"$f":"IF('PJ-JV'!D111=0,\"\",LEFT('PJ-JV'!T111,12))","v":""},{"$f":"IF('PJ-JV'!D111=0,\"\",LEFT('PJ-JV'!U111,20))","v":""}]
[{"$f":"IF('PJ-JV'!D112=0,\"\",\"IT\")","v":""},null,{"$f":"IF('PJ-JV'!D112=0,\"\",'PJ-JV'!B112)","v":""},null,null,null,null,null,null,null,null,{"$f":"IF('PJ-JV'!D112=0,\"\",LEFT('PJ-JV'!C112,6))","v":""},{"$f":"IF('PJ-JV'!D112=0,\"\",ROUND('PJ-JV'!D112,2))","v":""},{"$f":"IF('PJ-JV'!D112=0,\"\",LEFT('PJ-JV'!E112,6))","v":""},{"$f":"IF('PJ-JV'!D112=0,\"\",PROPER(LEFT('PJ-JV'!F112,4)))","v":""},{"$f":"IF('PJ-JV'!D112=0,\"\",LEFT('PJ-JV'!G112,9))","v":""},{"$f":"IF('PJ-JV'!D112=0,\"\",LEFT('PJ-JV'!H112,6))","v":""},{"$f":"IF('PJ-JV'!D112=0,\"\",LEFT('PJ-JV'!I112,24))","v":""},{"$f":"IF('PJ-JV'!D112=0,\"\",LEFT('PJ-JV'!J112,18))","v":""},{"$f":"IF('PJ-JV'!D112=0,\"\",LEFT('PJ-JV'!K112,50))","v":""},{"$f":"IF('PJ-JV'!D112=0,\"\",LEFT('PJ-JV'!L112,8))","v":""},{"$f":"IF('PJ-JV'!D112=0,\"\",LEFT('PJ-JV'!M112,10))","v":""},{"$f":"IF('PJ-JV'!D112=0,\"\",LEFT('PJ-JV'!N112,3))","v":""},{"$f":"IF('PJ-JV'!D112=0,\"\",LEFT('PJ-JV'!O112,6))","v":""},{"$f":"IF('PJ-JV'!D112=0,\"\",LEFT('PJ-JV'!P112,4))","v":""},{"$f":"IF('PJ-JV'!D112=0,\"\",LEFT('PJ-JV'!Q112,5))","v":""},{"$f":"IF('PJ-JV'!D112=0,\"\",LEFT('PJ-JV'!R112,4))","v":""},{"$f":"IF('PJ-JV'!D112=0,\"\",LEFT('PJ-JV'!S112,12))","v":""},{"$f":"IF('PJ-JV'!D112=0,\"\",LEFT('PJ-JV'!T112,12))","v":""},{"$f":"IF('PJ-JV'!D112=0,\"\",LEFT('PJ-JV'!U112,20))","v":""}]
[{"$f":"IF('PJ-JV'!D113=0,\"\",\"IT\")","v":""},null,{"$f":"IF('PJ-JV'!D113=0,\"\",'PJ-JV'!B113)","v":""},null,null,null,null,null,null,null,null,{"$f":"IF('PJ-JV'!D113=0,\"\",LEFT('PJ-JV'!C113,6))","v":""},{"$f":"IF('PJ-JV'!D113=0,\"\",ROUND('PJ-JV'!D113,2))","v":""},{"$f":"IF('PJ-JV'!D113=0,\"\",LEFT('PJ-JV'!E113,6))","v":""},{"$f":"IF('PJ-JV'!D113=0,\"\",PROPER(LEFT('PJ-JV'!F113,4)))","v":""},{"$f":"IF('PJ-JV'!D113=0,\"\",LEFT('PJ-JV'!G113,9))","v":""},{"$f":"IF('PJ-JV'!D113=0,\"\",LEFT('PJ-JV'!H113,6))","v":""},{"$f":"IF('PJ-JV'!D113=0,\"\",LEFT('PJ-JV'!I113,24))","v":""},{"$f":"IF('PJ-JV'!D113=0,\"\",LEFT('PJ-JV'!J113,18))","v":""},{"$f":"IF('PJ-JV'!D113=0,\"\",LEFT('PJ-JV'!K113,50))","v":""},{"$f":"IF('PJ-JV'!D113=0,\"\",LEFT('PJ-JV'!L113,8))","v":""},{"$f":"IF('PJ-JV'!D113=0,\"\",LEFT('PJ-JV'!M113,10))","v":""},{"$f":"IF('PJ-JV'!D113=0,\"\",LEFT('PJ-JV'!N113,3))","v":""},{"$f":"IF('PJ-JV'!D113=0,\"\",LEFT('PJ-JV'!O113,6))","v":""},{"$f":"IF('PJ-JV'!D113=0,\"\",LEFT('PJ-JV'!P113,4))","v":""},{"$f":"IF('PJ-JV'!D113=0,\"\",LEFT('PJ-JV'!Q113,5))","v":""},{"$f":"IF('PJ-JV'!D113=0,\"\",LEFT('PJ-JV'!R113,4))","v":""},{"$f":"IF('PJ-JV'!D113=0,\"\",LEFT('PJ-JV'!S113,12))","v":""},{"$f":"IF('PJ-JV'!D113=0,\"\",LEFT('PJ-JV'!T113,12))","v":""},{"$f":"IF('PJ-JV'!D113=0,\"\",LEFT('PJ-JV'!U113,20))","v":""}]

{"sheet":"Translation","index":3,"n_rows":36,"n_cols":2,"rows_kept":36,"cut":false,"hidden":true,"merged":[]}
[]
["Document Date *","Date pièce *"]
["Posting Date","Date comptable"]
["Header Reference (16 Char) *","Référence (16 Char) *"]
["Header Text (25 Char)","Texte d'en-tête (25 Char)"]
["Document Type *","Type de pièce *"]
["Company Code *","Société *"]
["Currency (3 Char)","Devise (3 Char)"]
["Fiscal Period (2 Char)","Période (2 Char)"]
["Trading Partner (3 Char)","Sté S/L parten. (3 Char)"]
["Warnings :","Avertissement(s) :"]
["JV not in balance","La pièce de journal doit être égale à $0."]
["Missing mandatory fields","Certains champs obligatoires sont manquants."]
["Company Code","Société"]
["Line \nItem # ","Poste "]
["G/L Account\n(6 Char) *","Compte\n(6 Char) *"]
["Amount\n(15 Char) *\nDebit (+)\nCredit (-)","Montant\n(15 Char) *\nDébit (+)\nCrédit (-)"]
["Cost Centre \n(6 Char) *","Centre coûts\n(6 Char) *"]
["Fund\n(4 Char) *","Fonds\n(4 Char) *"]
["Functional Area \n(9 Char) *","Domaine Fonctionnel \n(9 Char) *"]
["Internal Order \n(5 or 6 Char)","Ordre interne\n(5 ou 6 Char)"]
["Work Breakdown Structure (24 Char)","Élément d'OTP (24 Char)"]
["Assignment \n(18 Char)","Affectation\n(18 Char)"]
["Line Item Text\nFor salary use, please indicate the salary period.\n(50 Char)","Texte\nPour les salaires, veuillez préciser la période de salaire.\n(50 Char)"]
["PRI \n(8 Char)","Matricule\n(8 Char)"]
["Earmarked Fund #\n(10 Char)","Réservation de crédits\n(10 Char)"]
["Earmarked Fund Line #\n(3 Char)"," Poste de pièce: Réserv. crédits\n(3 Char)"]
["Fund Centre \n(6 Char)","Centre financier \n(6 Char)"]
["Client Department Office\n(4 Char)","Bureau du ministère client \n(4 Char)"]
["Network \n(5 Char)","Réseau \n(5 Char)"]
["Network Activity \n(4 Char)","Activité de réseau \n(4 Char)"]
["User Text1\n(12 Char)","Clé de réf. 1\n(12 Char)"]
["User Text2 \n(12 Char)","Clé de réf. 2\n(12 Char)"]
["User Text3 \n(20 Char)","Clé de réf. 3 \n(20 Char)"]
["Sélectionner la langue --­>","Select language --->"]
["* Indicates mandatory fields","* Indique un champ obligatoire"]